{"text_format":"1","workbook":"xlsx","n_sheets":3,"sheets":["Main","Input","Convert"],"not_rendered":{"charts":0,"images":4,"macros":1,"external_links":0,"defined_names":136,"comments":2,"pivot_tables":0},"unopened":[],"bounds":{"document_bytes":16777216,"sheet_cells":100000,"rows_first":2000,"rows_last":500,"rows_between":2000,"halvings":0,"cell_chars":16384,"cell_head_chars":4096},"cells_cut":0,"cells_raw":0,"read":"whole","date_system":"1900"}

{"sheet":"Main","index":0,"n_rows":56,"n_cols":2,"rows_kept":56,"cut":false,"hidden":false,"merged":[]}
[]
[]
[]
[]
[]
[]
[]
[]
[]
[]
[null,"OpenVSP-Connect"]
[null,"Connect YOUR Aircraft Design Tool with Vehicle Sketch Pad from NASA"]
[]
[]
[]
[]
[]
[]
[]
[null,"OpenVSP-Connect started as an interface tool between ANY aircraft design tool and Open Vehicle Sketch Pad (openVSP) from NASA."]
[null,"OpenVSP renders a 3D visualization of an aircraft. Follow this link for more information on OpenVSP:"]
[null,"http://www.openVSP.org"]
[]
[null,"OpenVSP-Connect still runs on OpenVSP 2.2.4 for Win 32."]
[null,"This version of OpenVSP is provided together with the OpenVSP-Connect download."]
[]
[null,"In the order of 47 core parameters of the aircraft are used to calculate the input parameters required by OpenVSP to sketch a passenger aircraft."]
[null,"For each parameter a proposed value is given and automatically applied as long as the user does not specify his/her own value."]
[]
[null,"By using all default values, the program works in \"Automatic Mode\":"]
[null,"Based on just two input values \"Cruise Mach Number\" and \"Number of Passengers\""]
[null,"an aircraft can be sketched automatically based on passenger aircraft statistics."]
[]
[null,"For further information, documentation, and software download please refer to:"]
[null,"http://OpenVSP.ProfScholz.de"]
[]
[null,"OpenVSP-Connect is a project by Aircraft Design and Systems Group (AERO) at Hamburg University of Applied Sciences  (HAW Hamburg)."]
[]
[null,"Copyright © 2020, Version 1.1"]
[null,"Veselin Pavlov, Tahir Sousa and Dieter Scholz"]
[]
[]
[]
[]
[]
[]
[null,"OpenVSP-Connect is free software: you can redistribute it and/or modify"]
[null,"it under the terms of the GNU General Public License as published by"]
[null,"the Free Software Foundation, License Version 3."]
[]
[null,"OpenVSP-Connect is distributed in the hope that it will be useful,"]
[null,"but WITHOUT ANY WARRANTY; without even the implied warranty of"]
[null,"MERCHANTABILITY or FITNESS FOR A PARTICULAR PURPOSE."]
[null,"See the GNU General Public License for more details."]
[]
[null,"http://www.gnu.org/licenses/ "]

{"sheet":"Input","index":1,"n_rows":131,"n_cols":31,"rows_kept":131,"cut":false,"hidden":false,"merged":[[0,1,0,4],[9,7,9,10],[3,2,3,5],[5,2,5,5]]}
[null,"Input of Aircraft Design Parameters"]
[null,"Enter the results from any aircraft sizing or aircraft conceptual design tool. If data is unknown, use default values as proposed here."]
[]
[null,"Aircraft Name","AirbusA330"]
[]
[null,"Description","Press \"3D-Visualization\" to draw the A330.\nFor data and background see\nBryan Wied, 2024. Nachentwurf - Airbus A330-200. - Available from:\nhttps://nbn-resolving.org/urn:nbn:de:gbv:18302-aero2024-06-18.012"]
[null,null,"\"Haus"]
["  1.","Action buttons"]
[]
[null,null,null,null,null,null,"Path to OpenVSP Executable","D:\\Homepage\\OpenVSP\\vsp.exe"]
[null,null,null,null,null,null,"Path to OpenVSP File","D:\\Homepage\\OpenVSP\\A330.vsp"]
[null,null,null,null,null,null,"Path to your Aircraft Design tool/data","D:\\Homepage\\OpenVSP"]
[null,null,null,null,null,null,"Name of your Aircraft Design tool/data","AircraftParameterContainerFull.xlsx"]
[]
[]
[]
[]
["  2.","Requirements"]
[]
[null,"Number of Passangers","np",244,"[-]"]
[null,"Cruise Mach Number","MCR",0.86,"[-]"]
[null,null,null,null,null,null,"Max. Operating Mach Number","MMO",{"$f":"M_CR + M22","v":0.9},"[-]","Mach number constant","kM,MO",0.04,"[-]"]
[]
["  3.","Engine"]
[]
[null,"Engine Type",null,"Jet","[-]",null,null,null,null,null,null,null,null,null,null,null,null,null,null,null,null,null,null,null,null,"Average Disc Loading",131,"[kW*m/kg] "]
[null,"Number of engines","ne",2,"[-]",null,null,null,null,null,null,null,null,null,null,null,null,null,null,null,null,null,null,null,null,"Disc Loading density",1.2250000000000001,"[kg/m3]"]
[]
[null,{"$f":"IF(Type_e=\"Jet\",\"Edit this section\",\"Do not edit this section\")","v":"Edit this section"}]
[null,"Jet"]
[null,"Total Engine Thrust","TTO",605,"[kN]","<<<<<<","Total Engine Thrust","TTO",{"$f":"(0.00110987068294407*n_p^2+0.393331615513631*n_p)*2.63967403072373+20.762394999916","v":448.52203405742011},"[kN]"]
[null,"Jet engine diameter","de,j",3.38,"[m]","<<<<<<","Engine diameter","de,j",{"$f":"(6.005*T_TO/n_e + 934.88)/1000","v":2.7513925000000001},"[m]"]
[null,"Jet engine length","le,j",{"$f":"I33","v":4.6396837500000006},"[m]","<<<<<<","Engine length","le,j",{"$f":"(8.8935*T_TO/n_e + 1949.4)/1000","v":4.6396837500000006},"[m]"]
[null,"Cowling cover",null,50,"% of core section"]
[]
[null,{"$f":"IF(Type_e=\"Propeller\",\"Edit this section\",\"Do not edit this section\")","v":"Do not edit this section"}]
[null,"Propeller"]
[null,"Total Engine Power","PTO",{"$f":"I38","v":11989.476892250334},"[kW]","<<<<<<","Total Engine Power","PTO",{"$f":"274.257204134621*(0.362865751969511*n_p)^0.842207666235257+20.67308469625","v":11989.476892250334},"[kW]"]
[null,"Number of blades","nb,p",6,"[-]",null,null,null," "]
[null,"Prop engine diameter","de,p",{"$f":"I40","v":0.83644218386013325},"[m]","<<<<<<","Engine diameter","de,p",{"$f":"(0.049*P_TO/n_e + 542.7)/1000","v":0.83644218386013325},"[m]"]
[null,"Prop engine length","le,p",{"$f":"I41","v":3.5522742103290548},"[m]","<<<<<<","Prop Length","le,p",{"$f":"(0.328*P_TO/n_e + 1586)/1000","v":3.5522742103290548},"[m]"]
[null,"Prop rotor diameter","de,p,r",{"$f":"I42","v":3.8910028638910115},"[m]","<<<<<<","Prop rotor diameter","de,p,r",{"$f":"2*SQRT((P_TO/n_e)/(DL_av*DL_den))/PI()","v":3.8910028638910115},"[m]"]
[]
["  4.","Wing"]
[]
[null,"Wing Type","TypeW","Double-trapezoidal","[-]"]
[null,"Total Area","SW",361.6,"[m2]","<<<<<<","Toral Area Suggestion","SW",{"$f":"IF(Type_e=\"Jet\",1.45473418814703*(0.00110987068294407*n_p^2+0.393331615513631*n_p)+20.67308469625,8.92220992837205*(0.362865751969511*n_p)^0.619379632830338)","v":256.41301470411264},"[m2]"]
[null,"Total Aspect ratio","AW",10.050000000000001,"[-]"]
[null,null,null,null,null,null,"Total Span","bw",{"$f":"SQRT(S_W*A_W)","v":60.28333102939817},"[m]"]
[null,{"$f":"IF(Type_W=\"Trapezoidal\", \"Wing 25% Sweep\", \"Outboard 25% Sweep\")","v":"Outboard 25% Sweep"},"j25,W,o",29.07,"[˚]","<<<<<<","25% Wing sweep suggestion","j25,W,o",{"$f":"IF(M_CR<0.54,0,27926.089*M_CR^6-133114.861*M_CR^5+262686.398*M_CR^4-274864.452*M_CR^3+160851.684*M_CR^2-49806.55*M_CR+6356.421)","v":28.26638851898133},"[˚]"]
[null,"Taper Ratio","λW",0.22,"[-]","<<<<<<","Taper Ratio Suggestion","λW",{"$f":"0.45*EXP(-0.0375*phi_25.W.o)","v":0.15127851117222088},"[-]"]
[null,null,null,null,null,null,"Root Chord","cr,w",{"$f":"(S_W - (b_W/2)*b_W.i*(TAN(phi_100.W.i*PI()/180) - TAN(phi_0.W.i*PI()/180)) )/ (b_W/2 + b_W.i + lam_W*(b_W/2 - b_W.i))","v":12.103960652426471},"[m]"]
[null,null,null,null,null,null,"Tip Chord","ct,w",{"$f":"lam_W*c_r.W","v":2.6628713435338236},"[m]"]
[null,null,null,null,null,null,{"$f":"IF(Type_W=\"Trapezoidal\", \"Wing Leading edge Sweep\", \"Outboard Leading edge Sweep\")","v":"Outboard Leading edge Sweep"},"j0,W,o",{"$f":"ATAN(TAN(phi_25.W.o*PI()/180)-(2/A_W.o)*((0-25)/100*(1-lam_W.o)/(1+lam_W.o)))*180/PI()","v":30.981652593950365},"[˚]"]
[null,null,null,null,null,null,"Outboard Trailing edge sweep","j100,W,o",{"$f":"ATAN(TAN(phi_25.W.o*PI()/180)-2/A_W.o*((100-25)/100*(1-lam_W.o)/(1+lam_W.o)))*180/PI()","v":22.896978819133999},"[m]"]
[null,"Airfoil thickness ratio","(t\\c)",0.15,"[-]","<<<<<<","Thickness ratio","(t\\c)",{"$f":"-0.045*ATAN(3*M_CR - 2.732) + 0.099","v":0.10578804127294229},"[-]",null,null,null,null,null,null,null,null,null,null,null,null,null,null,null,"Wing  MAC",{"$f":"c_W.k+ (0.35*(b_W/2) - b_W.i)*(TAN(phi_25.W.o*PI()/180) - TAN(phi_0.W.o*PI()/180))","v":6.2724078159449013},"[-]"]
[null,"X position of wing","RelPosW,x",{"$f":"I57","v":31.5},"% of fuselage length","<<<<<<","X position of wing",null,31.5,"% of fuselage length",null,null,null,null,null,null,null,null,null,null,null,null,null,null,null,"Outer Aspect Ratio",{"$f":"(b_W-2*b_W.i)/(c_t.W+c_W.k)","v":4.5671560184437823},"[-]"]
[null,"Z position of wing","RelPosW,z",25,"% of fuselage diameter",null,null,null,null,null,null,null,null,null,null,null,null,null,null,null,null,null,null,null,null,"Outer Taper Ratio",{"$f":"c_t.W/c_W.k","v":0.42183012122863894},"[-]"]
[null,"Outboard dihedral angle","ГW.o",5.0999999999999996,"[˚]","<<<<<<","Outboard dihedral angle","ГW.o",{"$f":"6.9137 - (7.46*RelPos_W.z/100) - (0.1153*phi_25.W.o)","v":1.6969290000000004},"[˚]",null,null,null,null,null,null,null,null,null,null,null,null,null,null,null,"Inboard Half-Span",{"$f":"eta_k.W*(b_W/2)","v":9.6453329647037069},"[m]"]
[null,null,null,null,null,null,null,null,null,null,null,null,null,null,null,null,null,null,null,null,null,null,null,null,null,"Kink chord",{"$f":"c_r.W + b_W.i*(TAN(phi_100.W.i*PI()/180) - TAN(phi_0.W.i*PI()/180))","v":6.3126628695405635},"[m]"]
[null,{"$f":"IF(Type_W= \"Double-trapezoidal\",\"Edit this section\",\"Do not edit this section\")","v":"Edit this section"}]
[null,"Relative kink position","ηk,W",{"$f":"I62","v":0.32},"[-]","<<<<<<","Relative kink position","ηk,W",{"$f":"IF(Type_W = \"Trapezoidal\", 0.5, M62)","v":0.32},"[-]","Relative kink constant","kη,k,W",0.32,"[-]"]
[null,"Inboard Leading edge Sweep","j0,W,i",{"$f":"I63","v":30.981652593950365},"[˚]","<<<<<<","Inboard Leading edge Sweep","j0,W,i",{"$f":"phi_0.W.o","v":30.981652593950365},"[˚]"]
[null,"Inboard Trailing edge Sweep","j100,W,i",{"$f":"I64","v":0},"[˚]","<<<<<<","Inboard Trailing edge Sweep","j100,W,i",{"$f":"IF(Type_W = \"Double-trapezoidal\", 0, phi_100.W.o)","v":0},"[˚]"]
[null,"Inboard dihedral angle","ГW.i",{"$f":"I65","v":5.0999999999999996},"[˚]","<<<<<<","Inboard dihedral angle","ГW.i",{"$f":"ggam_W.o","v":5.0999999999999996},"[˚]"]
[]
["  5.","Fuselage"]
[]
[null,"Fuselage diameter","dF",5.8310000000000004,"[m]","<<<<<<","Fuselage diameter","dF",{"$f":"IF(M69<7,0.045*(M69*0.495+2*0.025+0.4826)+0.084+(M69*0.495+2*0.025+0.4826),(M69*0.495+2*0.025+2*0.4826+2*0.15)*0.045+0.084+(M69*0.495+2*0.025+2*0.4826+2*0.15))","v":5.0793089999999994},"[m]","Number of seats per row","nSA",{"$f":"ROUND(0.45*SQRT(n_p),0)","v":7}]
[null,"Fuselage length","LF",58.31,"[m]","<<<<<<","Fuselage length","LF",{"$f":"M70*d_F","v":64.141000000000005},"[m]","Slenderness ratio","kl,F\\d,F",11,"[-]"]
[null,"Nose length","Lnose,F",{"$f":"I71","v":11.350333049999993},"[m]","<<<<<<","Nose length","Lnose,F",{"$f":"(44.405*(M_MO^2) -71.625*M_MO +30.441)*d_F","v":11.350333049999993},"[m]"]
[null,"Cockpit length","Lcock,F",{"$f":"I72","v":3.7901500000000006},"[m]","<<<<<<","Cockpit length","Lcock,F",{"$f":"M72*d_F","v":3.7901500000000006},"[m]","Cockpit length constant","kl,cock,F",0.65,"[-]"]
[null,"Fuselage aft length","Laft,F",{"$f":"I73","v":19.2423},"[m]","<<<<<<","Fuselage tail length","Ltail,F",{"$f":"M73*d_F","v":19.2423},"[m]","Fuselage tailcone constant","kl,tail,F",3.3,"[-]"]
[null,null,null,null,null,null,"Cylinder length","Lc,F",{"$f":"l_F-D71-D73","v":27.717366950000013},"[m]"]
[]
["  6.","Horizontal Tail"]
[]
[null,"Total aspect ratio","AH",5,"[-]","<<<<<<","Aspect Ratio","AH",{"$f":"M78*A_W","v":5.5626750000000005},"[-]","HT Aspect ratio constant","kA,H",0.55349999999999999,"[-]"]
[null,"Taper ratio","λH",0.33,"[-]","<<<<<<","Taper Ratio","λH",{"$f":"M79*lam_W","v":0.26400000000000001},"[-]","HT taper ratio constant","kλ,H",1.2,"[-]"]
[null,"Total area","SH",82.81,"[m2]","<<<<<<","Area","SH",{"$f":"100*C_H*S_W*c_MAC.W/((RelPos_H.x-RelPos_W.x)*l_F)","v":73.423320095367615},"[m2]","Tail volume coefficient of HT","CH",0.99099999999999999,"[-]"]
[null,"Sweep","j25,H",34.07,"[˚]","<<<<<<","Sweep","j25,H",{"$f":"phi_25.W.o+M81","v":34.07},"[˚]","HT 25% sweep constant","Δj25,H",5,"[-]"]
[null,"Dihedral angle","ГH",6,"[˚]","<<<<<<","Dihedral angle","ГH",{"$f":"0","v":0},"[˚]"]
[null,"X position of HT","RelPosH,x",{"$f":"I83","v":84},"% of fuselage length","<<<<<<","X position of HT","RelPosH,x",84,"% of fuselage length"]
[null,"Z position of HT","RelPosH,z",{"$f":"I84","v":-15},"% of VT span","<<<<<<","Z position of HT","RelPosH,z",-15,"% of VT span"]
[]
["  7.","Vertical Tail"]
[]
[null,"Dorsal fin?","Typedf","no","[-]"]
[]
[null,"Aspect Ratio","AV",1.6,"[-]","<<<<<<","Aspect Ratio","AV",{"$f":"IF(RelPos_H.z<0,2,M90 - (M90-Q90)*(RelPos_H.z/100))","v":2},"[-]","Aspect ratio for conv. Tail","kA,V,1",2,"[-]","Aspect ratio for t-tail","kA,V,2",0.7,"[-]"]
[null,"Taper Ratio","λV",0.36,"[-]","<<<<<<","Taper Ratio","λV",{"$f":"IF(RelPos_H.z<0,0.3,M91 + (Q91-M91)*RelPos_H.z/100)","v":0.3},"[-]","Taper ratio for conv. Tail","kλ,V,1",0.3,"[-]","Taper ratio for T-tail","kλ,V,2",1,"[-]"]
[null,"Area","SV",55.07,"[m2]","<<<<<<","Area","SV",{"$f":"100*C_V*S_W*b_W/((RelPos_H.x-RelPos_W.x)*l_F)","v":56.467232877420976},"[m2]","Tail volume coefficient of VT","CV",7.9299999999999995E-2,"[-]"]
[null,null,null,null,null,null,"Root Chord","cr,V",{"$f":"2*S_V/(b_V*(lam_V+1))","v":8.6275728322500154},"[m]"]
[null,null,null,null,null,null,"Tip Chord","ct,V",{"$f":"lam_V*c_r.V","v":3.1059262196100055},"[m]"]
[null,null,null,null,null,null,"Span","bV",{"$f":"SQRT(S_V*A_V)","v":9.386799241488017},"[m]"]
[]
[null,"25% Sweep","j25,V",45,"[˚]","<<<<<<","25% Sweep","j25,V",{"$f":"phi_25.H*(0.003*(phi_25.W.o^2) - 0.1847*phi_25.W.o + 4.0448)","v":41.250787399000018},"[˚]"]
[null,null,null,null,null,null,"Leading edge Sweep","j0,V",{"$f":"ATAN(TAN(phi_25.V*PI()/180)-2/A_V*((0-25)/100*(1-lam_V)/(1+lam_V)))*180/PI()","v":48.918248864067372},"[˚]"]
[null,null,null,null,null,null,"Trailing edge Sweep","j100,V",{"$f":"ATAN(TAN(phi_25.V*PI()/180)-2/A_V*((100-25)/100*(1-lam_V)/(1+lam_V)))*180/PI()","v":29.197486046064462},"[˚]"]
[null,"X position of VT","RelPosV,x",82,"% of fuselage length","<<<<<<","X position of VT","RelPosV,x",76.5,"% of fuselage length"]
[]
[null,"Dorsal fin extension"]
[null,{"$f":"IF(Type_df=\"Yes\",\"Edit this section\",\"Do not edit this section\")","v":"Do not edit this section"}]
[null,"Dorsal fin extension chord from VT","cr,df",{"$f":"I104","v":4.9608543785437584},"[m]","<<<<<<","Dorsal fin extension chord from VT","cr,df",{"$f":"IF(Type_e = \"Jet\", 0.575*c_r.V, 2.699*c_r.V)","v":4.9608543785437584},"[m]"]
[null,"Dorsal fin Leading edge sweep","j0,df",{"$f":"I105","v":74.878166641045297},"[°]","<<<<<<","Dorsal fin Leading edge sweep","j0,df",{"$f":"IF(Type_e = \"Jet\", 59.42 + 0.316*phi_0.V, 70.49 + 0.141*phi_0.V)","v":74.878166641045297},"[°]"]
[null,null,null,null,null,null,"Span","bdf",{"$f":"c_r.df/(TAN(phi_0.df*PI()/180) - TAN(phi_0.V*PI()/180))","v":1.9427675887662652},"[m]"]
[]
["  8.","Positions of Aircraft Components"]
[]
[null,"Component","X","Y","Z",null,"Component","X","Y","Z"]
[null,"Horizontal tail",{"$f":"H111","v":48.980400000000003},{"$f":"I111","v":0},{"$f":"J111","v":1.5074801137767977},"<<<<<<","Horizontal tail",{"$f":"(RelPos_H.x*l_F/100)","v":48.980400000000003},0,{"$f":"pos_V.z+(RelPos_H.z/100)*b_V","v":1.5074801137767977}]
[null,"Vertical tail",{"$f":"H112","v":47.8142},{"$f":"I112","v":0},{"$f":"J112","v":2.9155000000000002},"<<<<<<","Vertical tail",{"$f":"RelPos_V.x*l_F/100","v":47.8142},0,{"$f":"d_F/2","v":2.9155000000000002}]
[null,"Wing",18.367650000000001,0,-1.4577500000000001,"<<<<<<","Wing",{"$f":"RelPos_W.x*l_F/100","v":18.367650000000001},0,{"$f":" -d_F/2 +(RelPos_W.z/100)*d_F","v":-1.4577500000000001}]
[null,"Fuselage",0,0,0,"<<<<<<","Fuselage",0,0,0]
[null,{"$f":"\"Jet \" & Convert!$B$1213","v":"Jet Engine 2"},23.193146602423081,9.8231687912404322,-3.1710555412855181,"<<<<<<",{"$f":"\"Jet \" & Convert!$B$1213","v":"Jet Engine 2"},{"$f":"IF(n_e=1,pos_V.x,pos_W.x+(pos_e.j1.y*TAN(phi_0.W.o*PI()/180)) - l_e.j.pylon*TAN(phi_0.e.j.pylon*PI()/180))","v":23.193146602423081},{"$f":"IF(n_e=1,0,IF(OR(n_e=2,n_e=3),M115,Q115))*(b_W/2)/100","v":9.8231687912404322},{"$f":"IF(n_e=1,pos_V.z+d_e.j/2,pos_W.z+ pos_e.j1.y*TAN(ggam_W.o*PI()/180)-d_e.j/2-l_e.j.pylon)","v":-3.1710555412855181},"y-pos constant for 2 engines","kpos,e,j1,y",32.590000000000003,"[%]","y-pos constant for 4 engines","kpos,e,j1,y",39.299999999999997,"[%]"]
[null,{"$f":"\"Jet \" & Convert!$B$1746","v":"Jet Engine 1"},23.193146602423081,-9.8231687912404322,-3.1710555412855181,"<<<<<<",{"$f":"\"Jet \" & Convert!$B$1746","v":"Jet Engine 1"},{"$f":"IF(n_e=1,\"N/A\",pos_W.x-(pos_e.j2.y*TAN(phi_0.W.o*PI()/180)) - l_e.j.pylon*TAN(phi_0.e.j.pylon*PI()/180))","v":23.193146602423081},{"$f":"IF(n_e=1,\"N/A\",-pos_e.j1.y)","v":-9.8231687912404322},{"$f":"IF(n_e=1,\"N/A\",pos_e.j1.z)","v":-3.1710555412855181}]
[null,{"$f":"\"Jet \" & Convert!$B$2279","v":"Jet Engine 4"},"N/A","N/A","N/A","<<<<<<",{"$f":"\"Jet \" & Convert!$B$2279","v":"Jet Engine 4"},{"$f":"IF(OR(n_e=1,n_e=2),\"N/A\",IF(n_e=3,pos_V.x,pos_W.x+(pos_e.j3.y*TAN(phi_0.W.o*PI()/180)) - l_e.j.pylon*TAN(phi_0.e.j.pylon*PI()/180)))","v":"N/A"},{"$f":"IF(OR(n_e=1,n_e=2),\"N/A\",IF(n_e=3,0,M117*(b_W/2)/100))","v":"N/A"},{"$f":"IF(OR(n_e=1,n_e=2),\"N/A\",IF(n_e=3,pos_V.z + 0.65*d_e.j,pos_W.z+ pos_e.j3.y*TAN(ggam_W.o*PI()/180)-d_e.j/2-l_e.j.pylon))","v":"N/A"},"y-pos constant for 4 engines","kpos,e,j3,y",67.27,"[%]"]
[null,{"$f":"\"Jet \" & Convert!$B$2812","v":"Jet Engine 1"},"N/A","N/A","N/A","<<<<<<",{"$f":"\"Jet \" & Convert!$B$2812","v":"Jet Engine 1"},{"$f":"IF(n_e=4,pos_W.x-(pos_e.j4.y*TAN(phi_0.W.o*PI()/180)) - l_e.j.pylon*TAN(phi_0.e.j.pylon*PI()/180),\"N/A\")","v":"N/A"},{"$f":"IF(OR(n_e=1,n_e=2,n_e=3),\"N/A\",-pos_e.j3.y)","v":"N/A"},{"$f":"IF(n_e=4,pos_e.j3.z,\"N/A\")","v":"N/A"}]
[null,{"$f":"\"Prop \" & Convert!$B$1213","v":"Prop Engine 2"},20.950638475537112,5.7810014319455059,-1.3600304592366199,"<<<<<<",{"$f":"\"Prop \" & Convert!$B$1213","v":"Prop Engine 2"},{"$f":"IF(n_e=1,-0.1*l_e.p,pos_W.x+(pos_e.p1.y*TAN(phi_0.W.o*PI()/180) - 0.25*l_e.p))","v":20.950638475537112},{"$f":"IF(n_e=1,pos_F.y,IF(OR(n_e=2,n_e=3),d_F/2 + M119 + d_e.p.r/2,d_F/2 + Q119 + d_e.p.r/2))","v":5.7810014319455059},{"$f":"IF(n_e=1,pos_nose.F.z,pos_W.z-d_e.p/2 + pos_e.p1.y*TAN(ggam_W.o*PI()/180))","v":-1.3600304592366199},"2 engines inter-blade distance","yp1\\p2",0.92,"[-]","4 engines inter-blade distance","yp1\\p2",1.01,"[-]"]
[null,{"$f":"\"Prop \" & Convert!$B$1746","v":"Prop Engine 1"},20.950638475537112,-5.7810014319455059,-1.3600304592366199,"<<<<<<",{"$f":"\"Prop \" & Convert!$B$1746","v":"Prop Engine 1"},{"$f":"IF(n_e=1,\"N/A\",pos_e.p1.x)","v":20.950638475537112},{"$f":"IF(n_e=1,\"N/A\",-pos_e.p1.y)","v":-5.7810014319455059},{"$f":"IF(n_e=1,\"N/A\",pos_W.z -d_e.p/2- pos_e.p2.y*TAN(ggam_W.o*PI()/180))","v":-1.3600304592366199}]
[null,{"$f":"\"Prop \" & Convert!$B$2279","v":"Prop Engine 4"},"N/A","N/A","N/A","<<<<<<",{"$f":"\"Prop \" & Convert!$B$2279","v":"Prop Engine 4"},{"$f":"IF(OR(n_e=1,n_e=2),\"N/A\",IF(n_e=3,pos_V.x,pos_W.x- 0.25*l_e.p+(pos_e.p3.y*TAN(phi_0.W.o*PI()/180))))","v":"N/A"},{"$f":"IF(OR(n_e=1,n_e=2),\"N/A\",IF(n_e=3,0,IF(n_e=4,pos_e.p1.y + d_e.p.r + M121)))","v":"N/A"},{"$f":"IF(OR(n_e=1,n_e=2),\"N/A\",IF(n_e=3,pos_V.z+(d_e.p.r*0.6),pos_W.z-d_e.p/2 + pos_e.p3.y*TAN(ggam_W.o*PI()/180)))","v":"N/A"},"4 engines inter-blade distance","yp3\\p4",0.26,"[-]"]
[null,{"$f":"\"Prop \" & Convert!$B$2812","v":"Prop Engine 1"},"N/A","N/A","N/A","<<<<<<",{"$f":"\"Prop \" & Convert!$B$2812","v":"Prop Engine 1"},{"$f":"IF(n_e=4,pos_e.p3.x,\"N/A\")","v":"N/A"},{"$f":"IF(n_e=4, -pos_e.p3.y, \"N/A\")","v":"N/A"},{"$f":"IF(n_e=4,pos_W.z-d_e.p/2- pos_e.p4.y*TAN(ggam_W.o*PI()/180),\"N/A\")","v":"N/A"}]
[null,"Landing Gear 1",{"$f":"H123","v":24.365991395960016},6.5414497442631969,{"$f":"J123","v":-6.0739583333333345},"<<<<<<","Landing Gear 1",{"$f":"pos_W.x+ S_W/b_W","v":24.365991395960016},{"$f":"M123*b_W/2 - w_LG/2","v":6.5414497442631969},{"$f":"-(25/24)*d_F","v":-6.0739583333333345},"Rel. y-pos of LG on wing half-span","kLG1\\b.W\\2",0.222,"[-]"]
[null,"Landing Gear 3",{"$f":"H124","v":24.365991395960016},-6.8414497442631976,{"$f":"J124","v":-6.0739583333333345},"<<<<<<","Landing Gear 3",{"$f":"pos_LG1.x","v":24.365991395960016},{"$f":"-M123*b_W/2 - w_LG/2","v":-6.8414497442631976},{"$f":"-(25/24)*d_F","v":-6.0739583333333345}]
[null,"Landing Gear 2",5.8310000000000004,-0.15,{"$f":"J125","v":-6.0739583333333345},"<<<<<<","Landing Gear 2",{"$f":"d_F","v":5.8310000000000004},{"$f":" -w_LG/2","v":-0.15},{"$f":"-(25/24)*d_F","v":-6.0739583333333345}]
[]
[]
[]
[]
[]
[null,null,null,null,null,null,null,null,null,null,null,null,null,null,null,null,null,null,null,null,null,null,null,null,null,null,null,null,null,null,"compare all data with A320"]

{"sheet":"Convert","index":2,"n_rows":3601,"n_cols":14,"rows_kept":3601,"cut":false,"hidden":false,"merged":[]}
["Convert to OpenVSP XML",null,null,null,null,"Number of changes:",{"$f":"COUNTIF(E:E,\"No\")","v":82}]
["Convert data from Input-Tab to an OpenVSP XML file."]
[null,null,"Visualization",null,"Matching "]
["Parameter names","Parameter values","needed?","XML generated from OpenVSP Connect","with file?"]
[]
["xml version","\"1.0\"",null,{"$f":"\"<?\" & A6 & \"=\" & B6 & \"?>\"","v":"<?xml version=\"1.0\"?>"},{"$f":"IF(D6=F6,\"Yes\",\"No\")","v":"Yes"},"<?xml version=\"1.0\"?>"]
["Vsp_Geometry",null,null,{"$f":"\"<\" & A7 & \">\"","v":"<Vsp_Geometry>"},{"$f":"IF(D7=F7,\"Yes\",\"No\")","v":"Yes"},"<Vsp_Geometry>"]
["Version",3,null,{"$f":"\"<\" & A8 & \">\" & TEXT(B8,0) & \"</\" & A8 & \">\"","v":"<Version>3</Version>"},"Yes","<Version>3</Version>"]
["Name",{"$f":"Name_aircraft","v":"AirbusA330"},null,{"$f":"\"<\" & A9 & \">\" & TEXT(B9,0) & \"</\" & A9 & \">\"","v":"<Name>AirbusA330</Name>"},"No","<Name>AirbusA320</Name>"]
["CG_Rel_AC_Flag","No",null,{"$f":"\"<\" & A10 & \">\" &IF(B10=\"Yes\",1,0) &\"</\" &A10&\">\"","v":"<CG_Rel_AC_Flag>0</CG_Rel_AC_Flag>"},"Yes","<CG_Rel_AC_Flag>0</CG_Rel_AC_Flag>"]
["CG_X",10,null,{"$f":"\"<\" & A11 & \">\" & TEXT(B11,\"0.000000\") & \"</\" & A11 & \">\"","v":"<CG_X>10.000000</CG_X>"},"Yes","<CG_X>10.000000</CG_X>"]
["CG_Y",0,null,"<CG_Y>0.000000</CG_Y>","Yes","<CG_Y>0.000000</CG_Y>"]
["CG_Z",0,null,"<CG_Z>0.000000</CG_Z>","Yes","<CG_Z>0.000000</CG_Z>"]
["CFD_Mesh_Base_Length",0.5,null,"<CFD_Mesh_Base_Length>0.500000</CFD_Mesh_Base_Length>","Yes","<CFD_Mesh_Base_Length>0.500000</CFD_Mesh_Base_Length>"]
["CFD_Mesh_Min_Length",0.1,null,"<CFD_Mesh_Min_Length>0.100000</CFD_Mesh_Min_Length>","Yes","<CFD_Mesh_Min_Length>0.100000</CFD_Mesh_Min_Length>"]
["CFD_Mesh_Max_Gap",5.0000000000000001E-3,null,"<CFD_Mesh_Max_Gap>0.005000</CFD_Mesh_Max_Gap>","Yes","<CFD_Mesh_Max_Gap>0.005000</CFD_Mesh_Max_Gap>"]
["CFD_Mesh_Num_Circle_Segments",16,null,"<CFD_Mesh_Num_Circle_Segments>16.000000</CFD_Mesh_Num_Circle_Segments>","Yes","<CFD_Mesh_Num_Circle_Segments>16.000000</CFD_Mesh_Num_Circle_Segments>"]
["CFD_Mesh_Growth_Ratio",1.3,null,"<CFD_Mesh_Growth_Ratio>1.300000</CFD_Mesh_Growth_Ratio>","Yes","<CFD_Mesh_Growth_Ratio>1.300000</CFD_Mesh_Growth_Ratio>"]
["CFD_Mesh_Rigorous_Limiting",0,null,{"$f":"\"<\" & A19 & \">\" & TEXT(B19,0) & \"</\" & A19 & \">\"","v":"<CFD_Mesh_Rigorous_Limiting>0</CFD_Mesh_Rigorous_Limiting>"},"Yes","<CFD_Mesh_Rigorous_Limiting>0</CFD_Mesh_Rigorous_Limiting>"]
["CFD_Far_Field_Scale_X",4,null,{"$f":"\"<\" & A20 & \">\" & TEXT(B20,\"0.000000\") & \"</\" & A20 & \">\"","v":"<CFD_Far_Field_Scale_X>4.000000</CFD_Far_Field_Scale_X>"},"Yes","<CFD_Far_Field_Scale_X>4.000000</CFD_Far_Field_Scale_X>"]
["CFD_Far_Field_Scale_Y",4,null,{"$f":"\"<\" & A21 & \">\" & TEXT(B21,\"0.000000\") & \"</\" & A21 & \">\"","v":"<CFD_Far_Field_Scale_Y>4.000000</CFD_Far_Field_Scale_Y>"},"Yes","<CFD_Far_Field_Scale_Y>4.000000</CFD_Far_Field_Scale_Y>"]
["CFD_Far_Field_Scale_Z",4,null,{"$f":"\"<\" & A22 & \">\" & TEXT(B22,\"0.000000\") & \"</\" & A22 & \">\"","v":"<CFD_Far_Field_Scale_Z>4.000000</CFD_Far_Field_Scale_Z>"},"Yes","<CFD_Far_Field_Scale_Z>4.000000</CFD_Far_Field_Scale_Z>"]
["CFD_Half_Mesh_Flag","No",null,{"$f":"\"<\" & A23 & \">\" &IF(B23=\"Yes\",1,0) &\"</\" &A23&\">\"","v":"<CFD_Half_Mesh_Flag>0</CFD_Half_Mesh_Flag>"},"Yes","<CFD_Half_Mesh_Flag>0</CFD_Half_Mesh_Flag>"]
["CFD_Wake_Angle",0,null,{"$f":"\"<\" & A24 & \">\" & TEXT(B24,\"0.000000\") & \"</\" & A24 & \">\"","v":"<CFD_Wake_Angle>0.000000</CFD_Wake_Angle>"},"Yes","<CFD_Wake_Angle>0.000000</CFD_Wake_Angle>"]
["CFD_Wake_Scale",2,null,{"$f":"\"<\" & A25 & \">\" & TEXT(B25,\"0.000000\") & \"</\" & A25 & \">\"","v":"<CFD_Wake_Scale>2.000000</CFD_Wake_Scale>"},"Yes","<CFD_Wake_Scale>2.000000</CFD_Wake_Scale>"]
["VirtWindow_List",null,null,{"$f":"\"<\" & A26 & \">\"","v":"<VirtWindow_List>"},"Yes","<VirtWindow_List>"]
["VirtWindow",null,null,{"$f":"\"<\" & A27 & \">\"","v":"<VirtWindow>"},"Yes","<VirtWindow>"]
["Back_Img_Scale_W",1,null,{"$f":"\"<\" & A28 & \">\" & TEXT(B28,\"0.000000\") & \"</\" & A28 & \">\"","v":"<Back_Img_Scale_W>1.000000</Back_Img_Scale_W>"},"Yes","<Back_Img_Scale_W>1.000000</Back_Img_Scale_W>"]
["Back_Img_Scale_H",1,null,{"$f":"\"<\" & A29 & \">\" & TEXT(B29,\"0.000000\") & \"</\" & A29 & \">\"","v":"<Back_Img_Scale_H>1.000000</Back_Img_Scale_H>"},"Yes","<Back_Img_Scale_H>1.000000</Back_Img_Scale_H>"]
["Back_Img_Offset_X",0,null,{"$f":"\"<\" & A30 & \">\" & TEXT(B30,\"0.000000\") & \"</\" & A30 & \">\"","v":"<Back_Img_Offset_X>0.000000</Back_Img_Offset_X>"},"Yes","<Back_Img_Offset_X>0.000000</Back_Img_Offset_X>"]
["Back_Img_Offset_Y",0,null,{"$f":"\"<\" & A31 & \">\" & TEXT(B31,\"0.000000\") & \"</\" & A31 & \">\"","v":"<Back_Img_Offset_Y>0.000000</Back_Img_Offset_Y>"},"Yes","<Back_Img_Offset_Y>0.000000</Back_Img_Offset_Y>"]
["User_View_List",null,null,{"$f":"\"<\" & A32 & \">\"","v":"<User_View_List>"},"Yes","<User_View_List>"]
["User_View",null,null,{"$f":"\"<\" & A33 & \">\"","v":"<User_View>"},"Yes","<User_View>"]
["Saved_User_View_Flag","No",null,{"$f":"\"<\" & A34 & \">\" &IF(B34=\"Yes\",1,0) &\"</\" &A34&\">\"","v":"<Saved_User_View_Flag>0</Saved_User_View_Flag>"},"Yes","<Saved_User_View_Flag>0</Saved_User_View_Flag>"]
["/User_View",null,null,{"$f":"\"<\" & A35 & \">\"","v":"</User_View>"},"Yes","</User_View>"]
["User_View",null,null,{"$f":"\"<\" & A36 & \">\"","v":"<User_View>"},"Yes","<User_View>"]
["Saved_User_View_Flag","No",null,{"$f":"\"<\" & A37 & \">\" &IF(B37=\"Yes\",1,0) &\"</\" &A37&\">\"","v":"<Saved_User_View_Flag>0</Saved_User_View_Flag>"},"Yes","<Saved_User_View_Flag>0</Saved_User_View_Flag>"]
["/User_View",null,null,{"$f":"\"<\" & A38 & \">\"","v":"</User_View>"},"Yes","</User_View>"]
["User_View",null,null,{"$f":"\"<\" & A39 & \">\"","v":"<User_View>"},"Yes","<User_View>"]
["Saved_User_View_Flag","No",null,{"$f":"\"<\" & A40 & \">\" &IF(B40=\"Yes\",1,0) &\"</\" &A40&\">\"","v":"<Saved_User_View_Flag>0</Saved_User_View_Flag>"},"Yes","<Saved_User_View_Flag>0</Saved_User_View_Flag>"]
["/User_View",null,null,{"$f":"\"<\" & A41 & \">\"","v":"</User_View>"},"Yes","</User_View>"]
["User_View",null,null,{"$f":"\"<\" & A42 & \">\"","v":"<User_View>"},"Yes","<User_View>"]
["Saved_User_View_Flag","No",null,{"$f":"\"<\" & A43 & \">\" &IF(B43=\"Yes\",1,0) &\"</\" &A43&\">\"","v":"<Saved_User_View_Flag>0</Saved_User_View_Flag>"},"Yes","<Saved_User_View_Flag>0</Saved_User_View_Flag>"]
["/User_View",null,null,{"$f":"\"<\" & A44 & \">\"","v":"</User_View>"},"Yes","</User_View>"]
["/User_View_List",null,null,{"$f":"\"<\" & A45 & \">\"","v":"</User_View_List>"},"Yes","</User_View_List>"]
["/VirtWindow",null,null,{"$f":"\"<\" & A46 & \">\"","v":"</VirtWindow>"},"Yes","</VirtWindow>"]
["VirtWindow",null,null,{"$f":"\"<\" & A47 & \">\"","v":"<VirtWindow>"},"Yes","<VirtWindow>"]
["Back_Img_Scale_W",1,null,{"$f":"\"<\" & A48 & \">\" & TEXT(B48,\"0.000000\") & \"</\" & A48 & \">\"","v":"<Back_Img_Scale_W>1.000000</Back_Img_Scale_W>"},"Yes","<Back_Img_Scale_W>1.000000</Back_Img_Scale_W>"]
["Back_Img_Scale_H",1,null,{"$f":"\"<\" & A49 & \">\" & TEXT(B49,\"0.000000\") & \"</\" & A49 & \">\"","v":"<Back_Img_Scale_H>1.000000</Back_Img_Scale_H>"},"Yes","<Back_Img_Scale_H>1.000000</Back_Img_Scale_H>"]
["Back_Img_Offset_X",0,null,{"$f":"\"<\" & A50 & \">\" & TEXT(B50,\"0.000000\") & \"</\" & A50 & \">\"","v":"<Back_Img_Offset_X>0.000000</Back_Img_Offset_X>"},"Yes","<Back_Img_Offset_X>0.000000</Back_Img_Offset_X>"]
["Back_Img_Offset_Y",0,null,{"$f":"\"<\" & A51 & \">\" & TEXT(B51,\"0.000000\") & \"</\" & A51 & \">\"","v":"<Back_Img_Offset_Y>0.000000</Back_Img_Offset_Y>"},"Yes","<Back_Img_Offset_Y>0.000000</Back_Img_Offset_Y>"]
["User_View_List",null,null,{"$f":"\"<\" & A52 & \">\"","v":"<User_View_List>"},"Yes","<User_View_List>"]
["User_View",null,null,{"$f":"\"<\" & A53 & \">\"","v":"<User_View>"},"Yes","<User_View>"]
["Saved_User_View_Flag","No",null,{"$f":"\"<\" & A54 & \">\" &IF(B54=\"Yes\",1,0) &\"</\" &A54&\">\"","v":"<Saved_User_View_Flag>0</Saved_User_View_Flag>"},"Yes","<Saved_User_View_Flag>0</Saved_User_View_Flag>"]
["/User_View",null,null,{"$f":"\"<\" & A55 & \">\"","v":"</User_View>"},"Yes","</User_View>"]
["User_View",null,null,{"$f":"\"<\" & A56 & \">\"","v":"<User_View>"},"Yes","<User_View>"]
["Saved_User_View_Flag","No",null,{"$f":"\"<\" & A57 & \">\" &IF(B57=\"Yes\",1,0) &\"</\" &A57&\">\"","v":"<Saved_User_View_Flag>0</Saved_User_View_Flag>"},"Yes","<Saved_User_View_Flag>0</Saved_User_View_Flag>"]
["/User_View",null,null,{"$f":"\"<\" & A58 & \">\"","v":"</User_View>"},"Yes","</User_View>"]
["User_View",null,null,{"$f":"\"<\" & A59 & \">\"","v":"<User_View>"},"Yes","<User_View>"]
["Saved_User_View_Flag","No",null,{"$f":"\"<\" & A60 & \">\" &IF(B60=\"Yes\",1,0) &\"</\" &A60&\">\"","v":"<Saved_User_View_Flag>0</Saved_User_View_Flag>"},"Yes","<Saved_User_View_Flag>0</Saved_User_View_Flag>"]
["/User_View",null,null,{"$f":"\"<\" & A61 & \">\"","v":"</User_View>"},"Yes","</User_View>"]
["User_View",null,null,{"$f":"\"<\" & A62 & \">\"","v":"<User_View>"},"Yes","<User_View>"]
["Saved_User_View_Flag","No",null,{"$f":"\"<\" & A63 & \">\" &IF(B63=\"Yes\",1,0) &\"</\" &A63&\">\"","v":"<Saved_User_View_Flag>0</Saved_User_View_Flag>"},"Yes","<Saved_User_View_Flag>0</Saved_User_View_Flag>"]
["/User_View",null,null,{"$f":"\"<\" & A64 & \">\"","v":"</User_View>"},"Yes","</User_View>"]
["/User_View_List",null,null,{"$f":"\"<\" & A65 & \">\"","v":"</User_View_List>"},"Yes","</User_View_List>"]
["/VirtWindow",null,null,{"$f":"\"<\" & A66 & \">\"","v":"</VirtWindow>"},"Yes","</VirtWindow>"]
["VirtWindow",null,null,{"$f":"\"<\" & A67 & \">\"","v":"<VirtWindow>"},"Yes","<VirtWindow>"]
["Back_Img_Scale_W",1,null,{"$f":"\"<\" & A68 & \">\" & TEXT(B68,\"0.000000\") & \"</\" & A68 & \">\"","v":"<Back_Img_Scale_W>1.000000</Back_Img_Scale_W>"},"Yes","<Back_Img_Scale_W>1.000000</Back_Img_Scale_W>"]
["Back_Img_Scale_H",1,null,{"$f":"\"<\" & A69 & \">\" & TEXT(B69,\"0.000000\") & \"</\" & A69 & \">\"","v":"<Back_Img_Scale_H>1.000000</Back_Img_Scale_H>"},"Yes","<Back_Img_Scale_H>1.000000</Back_Img_Scale_H>"]
["Back_Img_Offset_X",0,null,{"$f":"\"<\" & A70 & \">\" & TEXT(B70,\"0.000000\") & \"</\" & A70 & \">\"","v":"<Back_Img_Offset_X>0.000000</Back_Img_Offset_X>"},"Yes","<Back_Img_Offset_X>0.000000</Back_Img_Offset_X>"]
["Back_Img_Offset_Y",0,null,{"$f":"\"<\" & A71 & \">\" & TEXT(B71,\"0.000000\") & \"</\" & A71 & \">\"","v":"<Back_Img_Offset_Y>0.000000</Back_Img_Offset_Y>"},{"$f":"IF(D71=F71,\"Yes\",\"No\")","v":"Yes"},"<Back_Img_Offset_Y>0.000000</Back_Img_Offset_Y>"]
["User_View_List",null,null,{"$f":"\"<\" & A72 & \">\"","v":"<User_View_List>"},"Yes","<User_View_List>"]
["User_View",null,null,{"$f":"\"<\" & A73 & \">\"","v":"<User_View>"},"Yes","<User_View>"]
["Saved_User_View_Flag","No",null,{"$f":"\"<\" & A74 & \">\" &IF(B74=\"Yes\",1,0) &\"</\" &A74&\">\"","v":"<Saved_User_View_Flag>0</Saved_User_View_Flag>"},"Yes","<Saved_User_View_Flag>0</Saved_User_View_Flag>"]
["/User_View",null,null,{"$f":"\"<\" & A75 & \">\"","v":"</User_View>"},"Yes","</User_View>"]
["User_View",null,null,{"$f":"\"<\" & A76 & \">\"","v":"<User_View>"},"Yes","<User_View>"]
["Saved_User_View_Flag","No",null,{"$f":"\"<\" & A77 & \">\" &IF(B77=\"Yes\",1,0) &\"</\" &A77&\">\"","v":"<Saved_User_View_Flag>0</Saved_User_View_Flag>"},"Yes","<Saved_User_View_Flag>0</Saved_User_View_Flag>"]
["/User_View",null,null,{"$f":"\"<\" & A78 & \">\"","v":"</User_View>"},"Yes","</User_View>"]
["User_View",null,null,{"$f":"\"<\" & A79 & \">\"","v":"<User_View>"},"Yes","<User_View>"]
["Saved_User_View_Flag","No",null,{"$f":"\"<\" & A80 & \">\" &IF(B80=\"Yes\",1,0) &\"</\" &A80&\">\"","v":"<Saved_User_View_Flag>0</Saved_User_View_Flag>"},"Yes","<Saved_User_View_Flag>0</Saved_User_View_Flag>"]
["/User_View",null,null,{"$f":"\"<\" & A81 & \">\"","v":"</User_View>"},"Yes","</User_View>"]
["User_View",null,null,{"$f":"\"<\" & A82 & \">\"","v":"<User_View>"},"Yes","<User_View>"]
["Saved_User_View_Flag","No",null,{"$f":"\"<\" & A83 & \">\" &IF(B83=\"Yes\",1,0) &\"</\" &A83&\">\"","v":"<Saved_User_View_Flag>0</Saved_User_View_Flag>"},"Yes","<Saved_User_View_Flag>0</Saved_User_View_Flag>"]
["/User_View",null,null,{"$f":"\"<\" & A84 & \">\"","v":"</User_View>"},"Yes","</User_View>"]
["/User_View_List",null,null,{"$f":"\"<\" & A85 & \">\"","v":"</User_View_List>"},"Yes","</User_View_List>"]
["/VirtWindow",null,null,{"$f":"\"<\" & A86 & \">\"","v":"</VirtWindow>"},"Yes","</VirtWindow>"]
["VirtWindow",null,null,{"$f":"\"<\" & A87 & \">\"","v":"<VirtWindow>"},"Yes","<VirtWindow>"]
["Back_Img_Scale_W",1,null,{"$f":"\"<\" & A88 & \">\" & TEXT(B88,\"0.000000\") & \"</\" & A88 & \">\"","v":"<Back_Img_Scale_W>1.000000</Back_Img_Scale_W>"},"Yes","<Back_Img_Scale_W>1.000000</Back_Img_Scale_W>"]
["Back_Img_Scale_H",1,null,{"$f":"\"<\" & A89 & \">\" & TEXT(B89,\"0.000000\") & \"</\" & A89 & \">\"","v":"<Back_Img_Scale_H>1.000000</Back_Img_Scale_H>"},"Yes","<Back_Img_Scale_H>1.000000</Back_Img_Scale_H>"]
["Back_Img_Offset_X",0,null,{"$f":"\"<\" & A90 & \">\" & TEXT(B90,\"0.000000\") & \"</\" & A90 & \">\"","v":"<Back_Img_Offset_X>0.000000</Back_Img_Offset_X>"},"Yes","<Back_Img_Offset_X>0.000000</Back_Img_Offset_X>"]
["Back_Img_Offset_Y",0,null,{"$f":"\"<\" & A91 & \">\" & TEXT(B91,\"0.000000\") & \"</\" & A91 & \">\"","v":"<Back_Img_Offset_Y>0.000000</Back_Img_Offset_Y>"},"Yes","<Back_Img_Offset_Y>0.000000</Back_Img_Offset_Y>"]
["User_View_List",null,null,{"$f":"\"<\" & A92 & \">\"","v":"<User_View_List>"},"Yes","<User_View_List>"]
["User_View",null,null,{"$f":"\"<\" & A93 & \">\"","v":"<User_View>"},"Yes","<User_View>"]
["Saved_User_View_Flag","No",null,{"$f":"\"<\" & A94 & \">\" &IF(B94=\"Yes\",1,0) &\"</\" &A94&\">\"","v":"<Saved_User_View_Flag>0</Saved_User_View_Flag>"},"Yes","<Saved_User_View_Flag>0</Saved_User_View_Flag>"]
["/User_View",null,null,{"$f":"\"<\" & A95 & \">\"","v":"</User_View>"},"Yes","</User_View>"]
["User_View",null,null,{"$f":"\"<\" & A96 & \">\"","v":"<User_View>"},"Yes","<User_View>"]
["Saved_User_View_Flag","No",null,{"$f":"\"<\" & A97 & \">\" &IF(B97=\"Yes\",1,0) &\"</\" &A97&\">\"","v":"<Saved_User_View_Flag>0</Saved_User_View_Flag>"},"Yes","<Saved_User_View_Flag>0</Saved_User_View_Flag>"]
["/User_View",null,null,{"$f":"\"<\" & A98 & \">\"","v":"</User_View>"},"Yes","</User_View>",null,null,null,null,null,"EXTRA AIRFOIL!"]
["User_View",null,null,{"$f":"\"<\" & A99 & \">\"","v":"<User_View>"},"Yes","<User_View>"]
["Saved_User_View_Flag","No",null,{"$f":"\"<\" & A100 & \">\" &IF(B100=\"Yes\",1,0) &\"</\" &A100&\">\"","v":"<Saved_User_View_Flag>0</Saved_User_View_Flag>"},"Yes","<Saved_User_View_Flag>0</Saved_User_View_Flag>"]
["/User_View",null,null,{"$f":"\"<\" & A101 & \">\"","v":"</User_View>"},"Yes","</User_View>"]
["User_View",null,null,{"$f":"\"<\" & A102 & \">\"","v":"<User_View>"},"Yes","<User_View>"]
["Saved_User_View_Flag","No",null,{"$f":"\"<\" & A103 & \">\" &IF(B103=\"Yes\",1,0) &\"</\" &A103&\">\"","v":"<Saved_User_View_Flag>0</Saved_User_View_Flag>"},"Yes","<Saved_User_View_Flag>0</Saved_User_View_Flag>"]
["/User_View",null,null,{"$f":"\"<\" & A104 & \">\"","v":"</User_View>"},"Yes","</User_View>"]
["/User_View_List",null,null,{"$f":"\"<\" & A105 & \">\"","v":"</User_View_List>"},"Yes","</User_View_List>"]
["/VirtWindow",null,null,{"$f":"\"<\" & A106 & \">\"","v":"</VirtWindow>"},"Yes","</VirtWindow>"]
["VirtWindow",null,null,{"$f":"\"<\" & A107 & \">\"","v":"<VirtWindow>"},"Yes","<VirtWindow>"]
["Back_Img_Scale_W",1,null,{"$f":"\"<\" & A108 & \">\" & TEXT(B108,\"0.000000\") & \"</\" & A108 & \">\"","v":"<Back_Img_Scale_W>1.000000</Back_Img_Scale_W>"},"Yes","<Back_Img_Scale_W>1.000000</Back_Img_Scale_W>"]
["Back_Img_Scale_H",1,null,{"$f":"\"<\" & A109 & \">\" & TEXT(B109,\"0.000000\") & \"</\" & A109 & \">\"","v":"<Back_Img_Scale_H>1.000000</Back_Img_Scale_H>"},"Yes","<Back_Img_Scale_H>1.000000</Back_Img_Scale_H>"]
["Back_Img_Offset_X",0,null,{"$f":"\"<\" & A110 & \">\" & TEXT(B110,\"0.000000\") & \"</\" & A110 & \">\"","v":"<Back_Img_Offset_X>0.000000</Back_Img_Offset_X>"},"Yes","<Back_Img_Offset_X>0.000000</Back_Img_Offset_X>"]
["Back_Img_Offset_Y",0,null,{"$f":"\"<\" & A111 & \">\" & TEXT(B111,\"0.000000\") & \"</\" & A111 & \">\"","v":"<Back_Img_Offset_Y>0.000000</Back_Img_Offset_Y>"},"Yes","<Back_Img_Offset_Y>0.000000</Back_Img_Offset_Y>"]
["User_View_List",null,null,{"$f":"\"<\" & A112 & \">\"","v":"<User_View_List>"},"Yes","<User_View_List>"]
["User_View",null,null,{"$f":"\"<\" & A113 & \">\"","v":"<User_View>"},"Yes","<User_View>"]
["Saved_User_View_Flag","No",null,{"$f":"\"<\" & A114 & \">\" &IF(B114=\"Yes\",1,0) &\"</\" &A114&\">\"","v":"<Saved_User_View_Flag>0</Saved_User_View_Flag>"},"Yes","<Saved_User_View_Flag>0</Saved_User_View_Flag>"]
["/User_View",null,null,{"$f":"\"<\" & A115 & \">\"","v":"</User_View>"},"Yes","</User_View>"]
["User_View",null,null,{"$f":"\"<\" & A116 & \">\"","v":"<User_View>"},"Yes","<User_View>"]
["Saved_User_View_Flag","No",null,{"$f":"\"<\" & A117 & \">\" &IF(B117=\"Yes\",1,0) &\"</\" &A117&\">\"","v":"<Saved_User_View_Flag>0</Saved_User_View_Flag>"},"Yes","<Saved_User_View_Flag>0</Saved_User_View_Flag>"]
["/User_View",null,null,{"$f":"\"<\" & A118 & \">\"","v":"</User_View>"},"Yes","</User_View>"]
["User_View",null,null,{"$f":"\"<\" & A119 & \">\"","v":"<User_View>"},"Yes","<User_View>"]
["Saved_User_View_Flag","No",null,{"$f":"\"<\" & A120 & \">\" &IF(B120=\"Yes\",1,0) &\"</\" &A120&\">\"","v":"<Saved_User_View_Flag>0</Saved_User_View_Flag>"},"Yes","<Saved_User_View_Flag>0</Saved_User_View_Flag>"]
["/User_View",null,null,{"$f":"\"<\" & A121 & \">\"","v":"</User_View>"},"Yes","</User_View>"]
["User_View",null,null,{"$f":"\"<\" & A122 & \">\"","v":"<User_View>"},"Yes","<User_View>"]
["Saved_User_View_Flag","No",null,{"$f":"\"<\" & A123 & \">\" &IF(B123=\"Yes\",1,0) &\"</\" &A123&\">\"","v":"<Saved_User_View_Flag>0</Saved_User_View_Flag>"},"Yes","<Saved_User_View_Flag>0</Saved_User_View_Flag>"]
["/User_View",null,null,{"$f":"\"<\" & A124 & \">\"","v":"</User_View>"},"Yes","</User_View>"]
["/User_View_List",null,null,{"$f":"\"<\" & A125 & \">\"","v":"</User_View_List>"},"Yes","</User_View_List>"]
["/VirtWindow",null,null,{"$f":"\"<\" & A126 & \">\"","v":"</VirtWindow>"},"Yes","</VirtWindow>"]
["VirtWindow",null,null,{"$f":"\"<\" & A127 & \">\"","v":"<VirtWindow>"},"Yes","<VirtWindow>"]
["Back_Img_Scale_W",1,null,{"$f":"\"<\" & A128 & \">\" & TEXT(B128,\"0.000000\") & \"</\" & A128 & \">\"","v":"<Back_Img_Scale_W>1.000000</Back_Img_Scale_W>"},"Yes","<Back_Img_Scale_W>1.000000</Back_Img_Scale_W>"]
["Back_Img_Scale_H",1,null,{"$f":"\"<\" & A129 & \">\" & TEXT(B129,\"0.000000\") & \"</\" & A129 & \">\"","v":"<Back_Img_Scale_H>1.000000</Back_Img_Scale_H>"},"Yes","<Back_Img_Scale_H>1.000000</Back_Img_Scale_H>"]
["Back_Img_Offset_X",0,null,{"$f":"\"<\" & A130 & \">\" & TEXT(B130,\"0.000000\") & \"</\" & A130 & \">\"","v":"<Back_Img_Offset_X>0.000000</Back_Img_Offset_X>"},"Yes","<Back_Img_Offset_X>0.000000</Back_Img_Offset_X>"]
["Back_Img_Offset_Y",0,null,{"$f":"\"<\" & A131 & \">\" & TEXT(B131,\"0.000000\") & \"</\" & A131 & \">\"","v":"<Back_Img_Offset_Y>0.000000</Back_Img_Offset_Y>"},"Yes","<Back_Img_Offset_Y>0.000000</Back_Img_Offset_Y>"]
["User_View_List",null,null,{"$f":"\"<\" & A132 & \">\"","v":"<User_View_List>"},"Yes","<User_View_List>"]
["User_View",null,null,{"$f":"\"<\" & A133 & \">\"","v":"<User_View>"},"Yes","<User_View>"]
["Saved_User_View_Flag","No",null,{"$f":"\"<\" & A134 & \">\" &IF(B134=\"Yes\",1,0) &\"</\" &A134&\">\"","v":"<Saved_User_View_Flag>0</Saved_User_View_Flag>"},"Yes","<Saved_User_View_Flag>0</Saved_User_View_Flag>"]
["/User_View",null,null,{"$f":"\"<\" & A135 & \">\"","v":"</User_View>"},{"$f":"IF(D135=F135,\"Yes\",\"No\")","v":"Yes"},"</User_View>"]
["User_View",null,null,{"$f":"\"<\" & A136 & \">\"","v":"<User_View>"},"Yes","<User_View>"]
["Saved_User_View_Flag","No",null,{"$f":"\"<\" & A137 & \">\" &IF(B137=\"Yes\",1,0) &\"</\" &A137&\">\"","v":"<Saved_User_View_Flag>0</Saved_User_View_Flag>"},"Yes","<Saved_User_View_Flag>0</Saved_User_View_Flag>"]
["/User_View",null,null,{"$f":"\"<\" & A138 & \">\"","v":"</User_View>"},"Yes","</User_View>"]
["User_View",null,null,{"$f":"\"<\" & A139 & \">\"","v":"<User_View>"},"Yes","<User_View>"]
["Saved_User_View_Flag","No",null,{"$f":"\"<\" & A140 & \">\" &IF(B140=\"Yes\",1,0) &\"</\" &A140&\">\"","v":"<Saved_User_View_Flag>0</Saved_User_View_Flag>"},"Yes","<Saved_User_View_Flag>0</Saved_User_View_Flag>"]
["/User_View",null,null,{"$f":"\"<\" & A141 & \">\"","v":"</User_View>"},"Yes","</User_View>"]
["User_View",null,null,{"$f":"\"<\" & A142 & \">\"","v":"<User_View>"},"Yes","<User_View>"]
["Saved_User_View_Flag","No",null,{"$f":"\"<\" & A143 & \">\" &IF(B143=\"Yes\",1,0) &\"</\" &A143&\">\"","v":"<Saved_User_View_Flag>0</Saved_User_View_Flag>"},"Yes","<Saved_User_View_Flag>0</Saved_User_View_Flag>"]
["/User_View",null,null,{"$f":"\"<\" & A144 & \">\"","v":"</User_View>"},"Yes","</User_View>"]
["/User_View_List",null,null,{"$f":"\"<\" & A145 & \">\"","v":"</User_View_List>"},"Yes","</User_View_List>"]
["/VirtWindow",null,null,{"$f":"\"<\" & A146 & \">\"","v":"</VirtWindow>"},"Yes","</VirtWindow>"]
["VirtWindow",null,null,{"$f":"\"<\" & A147 & \">\"","v":"<VirtWindow>"},"Yes","<VirtWindow>"]
["Back_Img_Scale_W",1,null,{"$f":"\"<\" & A148 & \">\" & TEXT(B148,\"0.000000\") & \"</\" & A148 & \">\"","v":"<Back_Img_Scale_W>1.000000</Back_Img_Scale_W>"},"Yes","<Back_Img_Scale_W>1.000000</Back_Img_Scale_W>"]
["Back_Img_Scale_H",1,null,{"$f":"\"<\" & A149 & \">\" & TEXT(B149,\"0.000000\") & \"</\" & A149 & \">\"","v":"<Back_Img_Scale_H>1.000000</Back_Img_Scale_H>"},"Yes","<Back_Img_Scale_H>1.000000</Back_Img_Scale_H>"]
["Back_Img_Offset_X",0,null,{"$f":"\"<\" & A150 & \">\" & TEXT(B150,\"0.000000\") & \"</\" & A150 & \">\"","v":"<Back_Img_Offset_X>0.000000</Back_Img_Offset_X>"},"Yes","<Back_Img_Offset_X>0.000000</Back_Img_Offset_X>"]
["Back_Img_Offset_Y",0,null,{"$f":"\"<\" & A151 & \">\" & TEXT(B151,\"0.000000\") & \"</\" & A151 & \">\"","v":"<Back_Img_Offset_Y>0.000000</Back_Img_Offset_Y>"},"Yes","<Back_Img_Offset_Y>0.000000</Back_Img_Offset_Y>"]
["User_View_List",null,null,{"$f":"\"<\" & A152 & \">\"","v":"<User_View_List>"},"Yes","<User_View_List>"]
["User_View",null,null,{"$f":"\"<\" & A153 & \">\"","v":"<User_View>"},"Yes","<User_View>"]
["Saved_User_View_Flag","No",null,{"$f":"\"<\" & A154 & \">\" &IF(B154=\"Yes\",1,0) &\"</\" &A154&\">\"","v":"<Saved_User_View_Flag>0</Saved_User_View_Flag>"},"Yes","<Saved_User_View_Flag>0</Saved_User_View_Flag>"]
["/User_View",null,null,{"$f":"\"<\" & A155 & \">\"","v":"</User_View>"},"Yes","</User_View>"]
["User_View",null,null,{"$f":"\"<\" & A156 & \">\"","v":"<User_View>"},"Yes","<User_View>"]
["Saved_User_View_Flag","No",null,{"$f":"\"<\" & A157 & \">\" &IF(B157=\"Yes\",1,0) &\"</\" &A157&\">\"","v":"<Saved_User_View_Flag>0</Saved_User_View_Flag>"},"Yes","<Saved_User_View_Flag>0</Saved_User_View_Flag>"]
["/User_View",null,null,{"$f":"\"<\" & A158 & \">\"","v":"</User_View>"},"Yes","</User_View>"]
["User_View",null,null,{"$f":"\"<\" & A159 & \">\"","v":"<User_View>"},"Yes","<User_View>"]
["Saved_User_View_Flag","No",null,{"$f":"\"<\" & A160 & \">\" &IF(B160=\"Yes\",1,0) &\"</\" &A160&\">\"","v":"<Saved_User_View_Flag>0</Saved_User_View_Flag>"},"Yes","<Saved_User_View_Flag>0</Saved_User_View_Flag>"]
["/User_View",null,null,{"$f":"\"<\" & A161 & \">\"","v":"</User_View>"},"Yes","</User_View>"]
["User_View",null,null,{"$f":"\"<\" & A162 & \">\"","v":"<User_View>"},"Yes","<User_View>"]
["Saved_User_View_Flag","No",null,{"$f":"\"<\" & A163 & \">\" &IF(B163=\"Yes\",1,0) &\"</\" &A163&\">\"","v":"<Saved_User_View_Flag>0</Saved_User_View_Flag>"},"Yes","<Saved_User_View_Flag>0</Saved_User_View_Flag>"]
["/User_View",null,null,{"$f":"\"<\" & A164 & \">\"","v":"</User_View>"},"Yes","</User_View>"]
["/User_View_List",null,null,{"$f":"\"<\" & A165 & \">\"","v":"</User_View_List>"},"Yes","</User_View_List>"]
["/VirtWindow",null,null,{"$f":"\"<\" & A166 & \">\"","v":"</VirtWindow>"},"Yes","</VirtWindow>"]
["VirtWindow",null,null,{"$f":"\"<\" & A167 & \">\"","v":"<VirtWindow>"},"Yes","<VirtWindow>"]
["Back_Img_Scale_W",1,null,{"$f":"\"<\" & A168 & \">\" & TEXT(B168,\"0.000000\") & \"</\" & A168 & \">\"","v":"<Back_Img_Scale_W>1.000000</Back_Img_Scale_W>"},"Yes","<Back_Img_Scale_W>1.000000</Back_Img_Scale_W>"]
["Back_Img_Scale_H",1,null,{"$f":"\"<\" & A169 & \">\" & TEXT(B169,\"0.000000\") & \"</\" & A169 & \">\"","v":"<Back_Img_Scale_H>1.000000</Back_Img_Scale_H>"},"Yes","<Back_Img_Scale_H>1.000000</Back_Img_Scale_H>"]
["Back_Img_Offset_X",0,null,{"$f":"\"<\" & A170 & \">\" & TEXT(B170,\"0.000000\") & \"</\" & A170 & \">\"","v":"<Back_Img_Offset_X>0.000000</Back_Img_Offset_X>"},"Yes","<Back_Img_Offset_X>0.000000</Back_Img_Offset_X>"]
["Back_Img_Offset_Y",0,null,{"$f":"\"<\" & A171 & \">\" & TEXT(B171,\"0.000000\") & \"</\" & A171 & \">\"","v":"<Back_Img_Offset_Y>0.000000</Back_Img_Offset_Y>"},"Yes","<Back_Img_Offset_Y>0.000000</Back_Img_Offset_Y>"]
["User_View_List",null,null,{"$f":"\"<\" & A172 & \">\"","v":"<User_View_List>"},"Yes","<User_View_List>"]
["User_View",null,null,{"$f":"\"<\" & A173 & \">\"","v":"<User_View>"},"Yes","<User_View>"]
["Saved_User_View_Flag","No",null,{"$f":"\"<\" & A174 & \">\" &IF(B174=\"Yes\",1,0) &\"</\" &A174&\">\"","v":"<Saved_User_View_Flag>0</Saved_User_View_Flag>"},"Yes","<Saved_User_View_Flag>0</Saved_User_View_Flag>"]
["/User_View",null,null,{"$f":"\"<\" & A175 & \">\"","v":"</User_View>"},"Yes","</User_View>"]
["User_View",null,null,{"$f":"\"<\" & A176 & \">\"","v":"<User_View>"},"Yes","<User_View>"]
["Saved_User_View_Flag","No",null,{"$f":"\"<\" & A177 & \">\" &IF(B177=\"Yes\",1,0) &\"</\" &A177&\">\"","v":"<Saved_User_View_Flag>0</Saved_User_View_Flag>"},"Yes","<Saved_User_View_Flag>0</Saved_User_View_Flag>"]
["/User_View",null,null,{"$f":"\"<\" & A178 & \">\"","v":"</User_View>"},"Yes","</User_View>"]
["User_View",null,null,{"$f":"\"<\" & A179 & \">\"","v":"<User_View>"},"Yes","<User_View>"]
["Saved_User_View_Flag","No",null,{"$f":"\"<\" & A180 & \">\" &IF(B180=\"Yes\",1,0) &\"</\" &A180&\">\"","v":"<Saved_User_View_Flag>0</Saved_User_View_Flag>"},"Yes","<Saved_User_View_Flag>0</Saved_User_View_Flag>"]
["/User_View",null,null,{"$f":"\"<\" & A181 & \">\"","v":"</User_View>"},"Yes","</User_View>"]
["User_View",null,null,{"$f":"\"<\" & A182 & \">\"","v":"<User_View>"},"Yes","<User_View>"]
["Saved_User_View_Flag","No",null,{"$f":"\"<\" & A183 & \">\" &IF(B183=\"Yes\",1,0) &\"</\" &A183&\">\"","v":"<Saved_User_View_Flag>0</Saved_User_View_Flag>"},"Yes","<Saved_User_View_Flag>0</Saved_User_View_Flag>"]
["/User_View",null,null,{"$f":"\"<\" & A184 & \">\"","v":"</User_View>"},"Yes","</User_View>"]
["/User_View_List",null,null,{"$f":"\"<\" & A185 & \">\"","v":"</User_View_List>"},"Yes","</User_View_List>"]
["/VirtWindow",null,null,{"$f":"\"<\" & A186 & \">\"","v":"</VirtWindow>"},"Yes","</VirtWindow>"]
["VirtWindow",null,null,{"$f":"\"<\" & A187 & \">\"","v":"<VirtWindow>"},"Yes","<VirtWindow>"]
["Back_Img_Scale_W",1,null,{"$f":"\"<\" & A188 & \">\" & TEXT(B188,\"0.000000\") & \"</\" & A188 & \">\"","v":"<Back_Img_Scale_W>1.000000</Back_Img_Scale_W>"},"Yes","<Back_Img_Scale_W>1.000000</Back_Img_Scale_W>"]
["Back_Img_Scale_H",1,null,{"$f":"\"<\" & A189 & \">\" & TEXT(B189,\"0.000000\") & \"</\" & A189 & \">\"","v":"<Back_Img_Scale_H>1.000000</Back_Img_Scale_H>"},"Yes","<Back_Img_Scale_H>1.000000</Back_Img_Scale_H>"]
["Back_Img_Offset_X",0,null,{"$f":"\"<\" & A190 & \">\" & TEXT(B190,\"0.000000\") & \"</\" & A190 & \">\"","v":"<Back_Img_Offset_X>0.000000</Back_Img_Offset_X>"},"Yes","<Back_Img_Offset_X>0.000000</Back_Img_Offset_X>"]
["Back_Img_Offset_Y",0,null,{"$f":"\"<\" & A191 & \">\" & TEXT(B191,\"0.000000\") & \"</\" & A191 & \">\"","v":"<Back_Img_Offset_Y>0.000000</Back_Img_Offset_Y>"},"Yes","<Back_Img_Offset_Y>0.000000</Back_Img_Offset_Y>"]
["User_View_List",null,null,{"$f":"\"<\" & A192 & \">\"","v":"<User_View_List>"},"Yes","<User_View_List>"]
["User_View",null,null,{"$f":"\"<\" & A193 & \">\"","v":"<User_View>"},"Yes","<User_View>"]
["Saved_User_View_Flag","No",null,{"$f":"\"<\" & A194 & \">\" &IF(B194=\"Yes\",1,0) &\"</\" &A194&\">\"","v":"<Saved_User_View_Flag>0</Saved_User_View_Flag>"},"Yes","<Saved_User_View_Flag>0</Saved_User_View_Flag>"]
["/User_View",null,null,{"$f":"\"<\" & A195 & \">\"","v":"</User_View>"},"Yes","</User_View>"]
["User_View",null,null,{"$f":"\"<\" & A196 & \">\"","v":"<User_View>"},"Yes","<User_View>"]
["Saved_User_View_Flag","No",null,{"$f":"\"<\" & A197 & \">\" &IF(B197=\"Yes\",1,0) &\"</\" &A197&\">\"","v":"<Saved_User_View_Flag>0</Saved_User_View_Flag>"},"Yes","<Saved_User_View_Flag>0</Saved_User_View_Flag>"]
["/User_View",null,null,{"$f":"\"<\" & A198 & \">\"","v":"</User_View>"},"Yes","</User_View>"]
["User_View",null,null,{"$f":"\"<\" & A199 & \">\"","v":"<User_View>"},{"$f":"IF(D199=F199,\"Yes\",\"No\")","v":"Yes"},"<User_View>"]
["Saved_User_View_Flag","No",null,{"$f":"\"<\" & A200 & \">\" &IF(B200=\"Yes\",1,0) &\"</\" &A200&\">\"","v":"<Saved_User_View_Flag>0</Saved_User_View_Flag>"},"Yes","<Saved_User_View_Flag>0</Saved_User_View_Flag>"]
["/User_View",null,null,{"$f":"\"<\" & A201 & \">\"","v":"</User_View>"},"Yes","</User_View>"]
["User_View",null,null,{"$f":"\"<\" & A202 & \">\"","v":"<User_View>"},"Yes","<User_View>"]
["Saved_User_View_Flag","No",null,{"$f":"\"<\" & A203 & \">\" &IF(B203=\"Yes\",1,0) &\"</\" &A203&\">\"","v":"<Saved_User_View_Flag>0</Saved_User_View_Flag>"},"Yes","<Saved_User_View_Flag>0</Saved_User_View_Flag>"]
["/User_View",null,null,{"$f":"\"<\" & A204 & \">\"","v":"</User_View>"},"Yes","</User_View>"]
["/User_View_List",null,null,{"$f":"\"<\" & A205 & \">\"","v":"</User_View_List>"},"Yes","</User_View_List>"]
["/VirtWindow",null,null,{"$f":"\"<\" & A206 & \">\"","v":"</VirtWindow>"},"Yes","</VirtWindow>",null,null,null,null,"2 AIRFOILS!!"]
["/VirtWindow_List",null,null,{"$f":"\"<\" & A207 & \">\"","v":"</VirtWindow_List>"},"Yes","</VirtWindow_List>"]
["Component_List",null,null,{"$f":"\"<\" & A208 & \">\"","v":"<Component_List>"},"Yes","<Component_List>"]
["Component","HORIZONTAL TAIL","Yes",{"$f":"IF(C209=\"Yes\",(\"<\"&A209&\">\"),(\"<!--\"&A209&\">\"))","v":"<Component>"},"Yes","<Component>"]
["Type","Mswing",null,{"$f":"\"<\" & A210 & \">\" & TEXT(B210,0) & \"</\" & A210 & \">\"","v":"<Type>Mswing</Type>"},"Yes","<Type>Mswing</Type>"]
["General_Parms",null,null,{"$f":"\"<\" & A211 & \">\"","v":"<General_Parms>"},"Yes","<General_Parms>"]
["Name","HTail",null,{"$f":"\"<\" & A212 & \">\" & TEXT(B212,0) & \"</\" & A212 & \">\"","v":"<Name>HTail</Name>"},"Yes","<Name>HTail</Name>"]
["ColorR",255,null,{"$f":"\"<\" & A213 & \">\" & TEXT(B213,\"0.000000\") & \"</\" & A213 & \">\"","v":"<ColorR>255.000000</ColorR>"},"Yes","<ColorR>255.000000</ColorR>"]
["ColorG",0,null,{"$f":"\"<\" & A214 & \">\" & TEXT(B214,\"0.000000\") & \"</\" & A214 & \">\"","v":"<ColorG>0.000000</ColorG>"},"Yes","<ColorG>0.000000</ColorG>"]
["ColorB",0,null,{"$f":"\"<\" & A215 & \">\" & TEXT(B215,\"0.000000\") & \"</\" & A215 & \">\"","v":"<ColorB>0.000000</ColorB>"},"Yes","<ColorB>0.000000</ColorB>"]
["Symmetry",2,null,{"$f":"\"<\" & A216 & \">\" & TEXT(B216,0) & \"</\" & A216 & \">\"","v":"<Symmetry>2</Symmetry>"},"Yes","<Symmetry>2</Symmetry>"]
["RelXFormFlag","No",null,{"$f":"\"<\" & A217 & \">\" &IF(B217=\"Yes\",1,0) &\"</\" &A217&\">\"","v":"<RelXFormFlag>0</RelXFormFlag>"},"Yes","<RelXFormFlag>0</RelXFormFlag>"]
["MaterialID",1,null,{"$f":"\"<\" & A218 & \">\" & TEXT(B218,0) & \"</\" & A218 & \">\"","v":"<MaterialID>1</MaterialID>"},"Yes","<MaterialID>1</MaterialID>"]
["OutputFlag","Yes",null,{"$f":"\"<\" & A219 & \">\" &IF(B219=\"Yes\",1,0) &\"</\" &A219&\">\"","v":"<OutputFlag>1</OutputFlag>"},"Yes","<OutputFlag>1</OutputFlag>"]
["OutputNameID",0,null,{"$f":"\"<\" & A220 & \">\" & TEXT(B220,0) & \"</\" & A220 & \">\"","v":"<OutputNameID>0</OutputNameID>"},"Yes","<OutputNameID>0</OutputNameID>"]
["DisplayChildrenFlag","Yes",null,{"$f":"\"<\" & A221 & \">\" &IF(B221=\"Yes\",1,0) &\"</\" &A221&\">\"","v":"<DisplayChildrenFlag>1</DisplayChildrenFlag>"},"Yes","<DisplayChildrenFlag>1</DisplayChildrenFlag>"]
["NumPnts",21,null,{"$f":"\"<\" & A222 & \">\" & TEXT(B222,0) & \"</\" & A222 & \">\"","v":"<NumPnts>21</NumPnts>"},"Yes","<NumPnts>21</NumPnts>"]
["NumXsecs",6,null,{"$f":"\"<\" & A223 & \">\" & TEXT(B223,0) & \"</\" & A223 & \">\"","v":"<NumXsecs>6</NumXsecs>"},"Yes","<NumXsecs>6</NumXsecs>"]
["MassPrior",0,null,{"$f":"\"<\" & A224 & \">\" & TEXT(B224,0) & \"</\" & A224 & \">\"","v":"<MassPrior>0</MassPrior>"},"Yes","<MassPrior>0</MassPrior>"]
["ShellFlag","No",null,{"$f":"\"<\" & A225 & \">\" &IF(B225=\"Yes\",1,0) &\"</\" &A225&\">\"","v":"<ShellFlag>0</ShellFlag>"},"Yes","<ShellFlag>0</ShellFlag>"]
["Tran_X",{"$f":"pos_H.x","v":48.980400000000003},null,{"$f":"\"<\" & A226 & \">\" & TEXT(B226,\"0.000000\") & \"</\" & A226 & \">\"","v":"<Tran_X>48.980400</Tran_X>"},"No","<Tran_X>30.072000</Tran_X>"]
["Tran_Y",{"$f":"pos_H.y","v":0},null,"<Tran_Y>0.000000</Tran_Y>","Yes","<Tran_Y>0.000000</Tran_Y>",null,null,null,null,"2 AIRFOILS!!"]
["Tran_Z",{"$f":"pos_H.z","v":1.5074801137767977},null,"<Tran_Z>1.507480</Tran_Z>","No","<Tran_Z>1.099473</Tran_Z>"]
["TranRel_X",0,null,"<TranRel_X>0.000000</TranRel_X>","Yes","<TranRel_X>0.000000</TranRel_X>"]
["TranRel_Y",0,null,"<TranRel_Y>0.000000</TranRel_Y>","Yes","<TranRel_Y>0.000000</TranRel_Y>"]
["TranRel_Z",0,null,"<TranRel_Z>0.000000</TranRel_Z>","Yes","<TranRel_Z>0.000000</TranRel_Z>"]
["Rot_X",0,null,"<Rot_X>0.000000</Rot_X>","Yes","<Rot_X>0.000000</Rot_X>"]
["Rot_Y",0,null,"<Rot_Y>0.000000</Rot_Y>","Yes","<Rot_Y>0.000000</Rot_Y>"]
["Rot_Z",0,null,"<Rot_Z>0.000000</Rot_Z>","Yes","<Rot_Z>0.000000</Rot_Z>"]
["RotRel_X",0,null,"<RotRel_X>0.000000</RotRel_X>","Yes","<RotRel_X>0.000000</RotRel_X>"]
["RotRel_Y",0,null,"<RotRel_Y>0.000000</RotRel_Y>","Yes","<RotRel_Y>0.000000</RotRel_Y>"]
["RotRel_Z",0,null,"<RotRel_Z>0.000000</RotRel_Z>","Yes","<RotRel_Z>0.000000</RotRel_Z>"]
["Origin",0,null,"<Origin>0.000000</Origin>","Yes","<Origin>0.000000</Origin>"]
["Density",1,null,"<Density>1.000000</Density>","Yes","<Density>1.000000</Density>"]
["ShellMassArea",1,null,"<ShellMassArea>1.000000</ShellMassArea>","Yes","<ShellMassArea>1.000000</ShellMassArea>"]
["RefFlag","No",null,{"$f":"\"<\" & A241 & \">\" &IF(B241=\"Yes\",1,0) &\"</\" &A241&\">\"","v":"<RefFlag>0</RefFlag>"},"Yes","<RefFlag>0</RefFlag>"]
["RefArea",20,null,{"$f":"\"<\" & A242 & \">\" & TEXT(B242,\"0.000000\") & \"</\" & A242 & \">\"","v":"<RefArea>20.000000</RefArea>"},"Yes","<RefArea>20.000000</RefArea>"]
["RefSpan",10,null,{"$f":"\"<\" & A243 & \">\" & TEXT(B243,\"0.000000\") & \"</\" & A243 & \">\"","v":"<RefSpan>10.000000</RefSpan>"},"Yes","<RefSpan>10.000000</RefSpan>"]
["RefCbar",1,null,{"$f":"\"<\" & A244 & \">\" & TEXT(B244,\"0.000000\") & \"</\" & A244 & \">\"","v":"<RefCbar>1.000000</RefCbar>"},"Yes","<RefCbar>1.000000</RefCbar>"]
["AutoRefAreaFlag","Yes",null,{"$f":"\"<\" & A245 & \">\" &IF(B245=\"Yes\",1,0) &\"</\" &A245&\">\"","v":"<AutoRefAreaFlag>1</AutoRefAreaFlag>"},"Yes","<AutoRefAreaFlag>1</AutoRefAreaFlag>"]
["AutoRefSpanFlag","Yes",null,{"$f":"\"<\" & A246 & \">\" &IF(B246=\"Yes\",1,0) &\"</\" &A246&\">\"","v":"<AutoRefSpanFlag>1</AutoRefSpanFlag>"},"Yes","<AutoRefSpanFlag>1</AutoRefSpanFlag>"]
["AutoRefCbarFlag","Yes",null,{"$f":"\"<\" & A247 & \">\" &IF(B247=\"Yes\",1,0) &\"</\" &A247&\">\"","v":"<AutoRefCbarFlag>1</AutoRefCbarFlag>"},"Yes","<AutoRefCbarFlag>1</AutoRefCbarFlag>"]
["AeroCenter_X",0,null,{"$f":"\"<\" & A248 & \">\" & TEXT(B248,\"0.000000\") & \"</\" & A248 & \">\"","v":"<AeroCenter_X>0.000000</AeroCenter_X>"},"Yes","<AeroCenter_X>0.000000</AeroCenter_X>"]
["AeroCenter_Y",0,null,{"$f":"\"<\" & A249 & \">\" & TEXT(B249,\"0.000000\") & \"</\" & A249 & \">\"","v":"<AeroCenter_Y>0.000000</AeroCenter_Y>"},"Yes","<AeroCenter_Y>0.000000</AeroCenter_Y>"]
["AeroCenter_Z",0,null,{"$f":"\"<\" & A250 & \">\" & TEXT(B250,\"0.000000\") & \"</\" & A250 & \">\"","v":"<AeroCenter_Z>0.000000</AeroCenter_Z>"},"Yes","<AeroCenter_Z>0.000000</AeroCenter_Z>"]
["AutoAeroCenterFlag","Yes",null,{"$f":"\"<\" & A251 & \">\" &IF(B251=\"Yes\",1,0) &\"</\" &A251&\">\"","v":"<AutoAeroCenterFlag>1</AutoAeroCenterFlag>"},"Yes","<AutoAeroCenterFlag>1</AutoAeroCenterFlag>"]
["WakeActiveFlag","No",null,{"$f":"\"<\" & A252 & \">\" &IF(B252=\"Yes\",1,0) &\"</\" &A252&\">\"","v":"<WakeActiveFlag>0</WakeActiveFlag>"},"Yes","<WakeActiveFlag>0</WakeActiveFlag>"]
["PosAttachFlag","No",null,{"$f":"\"<\" & A253 & \">\" &IF(B253=\"Yes\",1,0) &\"</\" &A253&\">\"","v":"<PosAttachFlag>0</PosAttachFlag>"},"Yes","<PosAttachFlag>0</PosAttachFlag>"]
["U_Attach",0,null,{"$f":"\"<\" & A254 & \">\" & TEXT(B254,\"0.000000\") & \"</\" & A254 & \">\"","v":"<U_Attach>0.000000</U_Attach>"},"Yes","<U_Attach>0.000000</U_Attach>"]
["V_Attach",0,null,{"$f":"\"<\" & A255 & \">\" & TEXT(B255,\"0.000000\") & \"</\" & A255 & \">\"","v":"<V_Attach>0.000000</V_Attach>"},"Yes","<V_Attach>0.000000</V_Attach>"]
["PtrID",148241632,null,"<PtrID>148241632</PtrID>","Yes","<PtrID>148241632</PtrID>"]
["Parent_PtrID","No",null,{"$f":"\"<\" & A257 & \">\" &IF(B257=\"Yes\",1,0) &\"</\" &A257&\">\"","v":"<Parent_PtrID>0</Parent_PtrID>"},"Yes","<Parent_PtrID>0</Parent_PtrID>"]
["/General_Parms",null,null,{"$f":"\"<\" & A258 & \">\"","v":"</General_Parms>"},"Yes","</General_Parms>"]
["Mswing_Parms",null,null,{"$f":"\"<\" & A259 & \">\"","v":"<Mswing_Parms>"},"Yes","<Mswing_Parms>"]
["Total_Area",{"$f":"S_H","v":82.81},null,{"$f":"\"<\" & A260 & \">\" & TEXT(B260,\"0.000000\") & \"</\" & A260 & \">\"","v":"<Total_Area>82.810000</Total_Area>"},"No","<Total_Area>31.000000</Total_Area>"]
["Total_Span",{"$f":"2*B321","v":20.348218595248088},null,{"$f":"\"<\" & A261 & \">\" & TEXT(B261,\"0.000000\") & \"</\" & A261 & \">\"","v":"<Total_Span>20.348219</Total_Span>"},"No","<Total_Span>12.449900</Total_Span>"]
["Total_Proj_Span",{"$f":"2*B321*COS(B328*PI()/180)","v":20.236748924714071},null,{"$f":"\"<\" & A262 & \">\" & TEXT(B262,\"0.000000\") & \"</\" & A262 & \">\"","v":"<Total_Proj_Span>20.236749</Total_Proj_Span>"},"No","<Total_Proj_Span>12.381698</Total_Proj_Span>"]
["Avg_Chord",{"$f":"B260/B261","v":4.0696437190496173},null,{"$f":"\"<\" & A263 & \">\" & TEXT(B263,\"0.000000\") & \"</\" & A263 & \">\"","v":"<Avg_Chord>4.069644</Avg_Chord>"},{"$f":"IF(D263=F263,\"Yes\",\"No\")","v":"No"},"<Avg_Chord>2.489980</Avg_Chord>"]
["Sweep_Off",0,null,{"$f":"\"<\" & A264 & \">\" & TEXT(B264,\"0.000000\") & \"</\" & A264 & \">\"","v":"<Sweep_Off>0.000000</Sweep_Off>"},"Yes","<Sweep_Off>0.000000</Sweep_Off>"]
["Deg_Per_Seg",9,null,{"$f":"\"<\" & A265 & \">\" & TEXT(B265,0) & \"</\" & A265 & \">\"","v":"<Deg_Per_Seg>9</Deg_Per_Seg>"},"Yes","<Deg_Per_Seg>9</Deg_Per_Seg>"]
["Max_Num_Seg",9,null,{"$f":"\"<\" & A266 & \">\" & TEXT(B266,0) & \"</\" & A266 & \">\"","v":"<Max_Num_Seg>9</Max_Num_Seg>"},"Yes","<Max_Num_Seg>9</Max_Num_Seg>"]
["Rel_Dihedral_Flag","No",null,{"$f":"\"<\" & A267 & \">\" &IF(B267=\"Yes\",1,0) &\"</\" &A267&\">\"","v":"<Rel_Dihedral_Flag>0</Rel_Dihedral_Flag>"},"Yes","<Rel_Dihedral_Flag>0</Rel_Dihedral_Flag>"]
["Rel_Twist_Flag","No",null,{"$f":"\"<\" & A268 & \">\" &IF(B268=\"Yes\",1,0) &\"</\" &A268&\">\"","v":"<Rel_Twist_Flag>0</Rel_Twist_Flag>"},"Yes","<Rel_Twist_Flag>0</Rel_Twist_Flag>"]
["acro","Yes",null,{"$f":"\"<\" & A269 & \">\" &IF(B269=\"Yes\",1,0) &\"</\" &A269&\">\"","v":"<acro>1</acro>"},"Yes","<acro>1</acro>"]
["/Mswing_Parms",null,null,{"$f":"\"<\" & A270 & \">\"","v":"</Mswing_Parms>"},"Yes","</Mswing_Parms>"]
["Airfoil_List",null,null,{"$f":"\"<\" & A271 & \">\"","v":"<Airfoil_List>"},"Yes","<Airfoil_List>"]
["Airfoil","Airfoil0",null,{"$f":"\"<\" & A272 & \">\"","v":"<Airfoil>"},"Yes","<Airfoil>"]
["Type","NACA 4-Series",null,{"$f":"\"<Type>\" & IF(B273=\"NACA 4-Series\",1,IF(B273=\"Biconvex\",2,IF(B273=\"Wedge\",3,IF(B273=\"Read File\",4,IF(B273=\"NACA 6-Series\",5,)))))&\"</Type>\"","v":"<Type>1</Type>"},"Yes","<Type>1</Type>"]
["Inverted_Flag","No",null,{"$f":"\"<\" & A274 & \">\" &IF(B274=\"Yes\",1,0) &\"</\" &A274&\">\"","v":"<Inverted_Flag>0</Inverted_Flag>"},"Yes","<Inverted_Flag>0</Inverted_Flag>"]
["Camber",0,null,{"$f":"\"<\" & A275 & \">\" & TEXT(B275,\"0.000000\") & \"</\" & A275 & \">\"","v":"<Camber>0.000000</Camber>"},"Yes","<Camber>0.000000</Camber>"]
["Camber_Loc",0.1,null,"<Camber_Loc>0.100000</Camber_Loc>","Yes","<Camber_Loc>0.100000</Camber_Loc>"]
["Thickness",0.1,null,"<Thickness>0.100000</Thickness>","Yes","<Thickness>0.100000</Thickness>"]
["Thickness_Loc",0.3,null,"<Thickness_Loc>0.300000</Thickness_Loc>","Yes","<Thickness_Loc>0.300000</Thickness_Loc>"]
["Radius_Le",1.1018999999999999E-2,null,"<Radius_Le>0.011019</Radius_Le>","Yes","<Radius_Le>0.011019</Radius_Le>"]
["Radius_Te",0,null,"<Radius_Te>0.000000</Radius_Te>","Yes","<Radius_Te>0.000000</Radius_Te>"]
["Six_Series",63,null,{"$f":"\"<\" & A281 & \">\" & TEXT(B281,0) & \"</\" & A281 & \">\"","v":"<Six_Series>63</Six_Series>"},"Yes","<Six_Series>63</Six_Series>"]
["Ideal_Cl",0,null,{"$f":"\"<\" & A282 & \">\" & TEXT(B282,\"0.000000\") & \"</\" & A282 & \">\"","v":"<Ideal_Cl>0.000000</Ideal_Cl>"},"Yes","<Ideal_Cl>0.000000</Ideal_Cl>"]
["A",0,null,{"$f":"\"<\" & A283 & \">\" & TEXT(B283,\"0.000000\") & \"</\" & A283 & \">\"","v":"<A>0.000000</A>"},"Yes","<A>0.000000</A>"]
["Slat_Flag","No",null,{"$f":"\"<\" & A284 & \">\" &IF(B284=\"Yes\",1,0) &\"</\" &A284&\">\"","v":"<Slat_Flag>0</Slat_Flag>"},"Yes","<Slat_Flag>0</Slat_Flag>"]
["Slat_Shear_Flag","No",null,{"$f":"\"<\" & A285 & \">\" &IF(B285=\"Yes\",1,0) &\"</\" &A285&\">\"","v":"<Slat_Shear_Flag>0</Slat_Shear_Flag>"},"Yes","<Slat_Shear_Flag>0</Slat_Shear_Flag>"]
["Slat_Chord",0.25,null,{"$f":"\"<\" & A286 & \">\" & TEXT(B286,\"0.000000\") & \"</\" & A286 & \">\"","v":"<Slat_Chord>0.250000</Slat_Chord>"},"Yes","<Slat_Chord>0.250000</Slat_Chord>"]
["Slat_Angle",10,null,{"$f":"\"<\" & A287 & \">\" & TEXT(B287,\"0.000000\") & \"</\" & A287 & \">\"","v":"<Slat_Angle>10.000000</Slat_Angle>"},"Yes","<Slat_Angle>10.000000</Slat_Angle>"]
["Flap_Flag","Yes",null,{"$f":"\"<\" & A288 & \">\" &IF(B288=\"Yes\",1,0) &\"</\" &A288&\">\"","v":"<Flap_Flag>1</Flap_Flag>"},"Yes","<Flap_Flag>1</Flap_Flag>"]
["Flap_Shear_Flag","No",null,{"$f":"\"<\" & A289 & \">\" &IF(B289=\"Yes\",1,0) &\"</\" &A289&\">\"","v":"<Flap_Shear_Flag>0</Flap_Shear_Flag>"},"Yes","<Flap_Shear_Flag>0</Flap_Shear_Flag>"]
["Flap_Chord",0.42,null,{"$f":"\"<\" & A290 & \">\" & TEXT(B290,\"0.000000\") & \"</\" & A290 & \">\"","v":"<Flap_Chord>0.420000</Flap_Chord>"},"Yes","<Flap_Chord>0.420000</Flap_Chord>"]
["Flap_Angle",10,null,{"$f":"\"<\" & A291 & \">\" & TEXT(B291,\"0.000000\") & \"</\" & A291 & \">\"","v":"<Flap_Angle>10.000000</Flap_Angle>"},"Yes","<Flap_Angle>10.000000</Flap_Angle>"]
["/Airfoil",null,null,{"$f":"\"<\" & A292 & \">\"","v":"</Airfoil>"},"Yes","</Airfoil>"]
["Airfoil","Airfoil1",null,{"$f":"\"<\" & A293 & \">\"","v":"<Airfoil>"},"Yes","<Airfoil>"]
["Type","NACA 4-Series",null,{"$f":"\"<Type>\" & IF(B294=\"NACA 4-Series\",1,IF(B294=\"Biconvex\",2,IF(B294=\"Wedge\",3,IF(B294=\"Read File\",4,IF(B294=\"NACA 6-Series\",5,)))))&\"</Type>\"","v":"<Type>1</Type>"},"Yes","<Type>1</Type>"]
["Inverted_Flag","No",null,{"$f":"\"<\" & A295 & \">\" &IF(B295=\"Yes\",1,0) &\"</\" &A295&\">\"","v":"<Inverted_Flag>0</Inverted_Flag>"},"Yes","<Inverted_Flag>0</Inverted_Flag>"]
["Camber",0,null,{"$f":"\"<\" & A296 & \">\" & TEXT(B296,\"0.000000\") & \"</\" & A296 & \">\"","v":"<Camber>0.000000</Camber>"},"Yes","<Camber>0.000000</Camber>"]
["Camber_Loc",0.1,null,"<Camber_Loc>0.100000</Camber_Loc>","Yes","<Camber_Loc>0.100000</Camber_Loc>"]
["Thickness",0.1,null,"<Thickness>0.100000</Thickness>","Yes","<Thickness>0.100000</Thickness>"]
["Thickness_Loc",0.3,null,"<Thickness_Loc>0.300000</Thickness_Loc>","Yes","<Thickness_Loc>0.300000</Thickness_Loc>"]
["Radius_Le",1.1018999999999999E-2,null,"<Radius_Le>0.011019</Radius_Le>","Yes","<Radius_Le>0.011019</Radius_Le>"]
["Radius_Te",0,null,"<Radius_Te>0.000000</Radius_Te>","Yes","<Radius_Te>0.000000</Radius_Te>"]
["Six_Series",63,null,{"$f":"\"<\" & A302 & \">\" & TEXT(B302,0) & \"</\" & A302 & \">\"","v":"<Six_Series>63</Six_Series>"},"Yes","<Six_Series>63</Six_Series>"]
["Ideal_Cl",0,null,{"$f":"\"<\" & A303 & \">\" & TEXT(B303,\"0.000000\") & \"</\" & A303 & \">\"","v":"<Ideal_Cl>0.000000</Ideal_Cl>"},"Yes","<Ideal_Cl>0.000000</Ideal_Cl>"]
["A",0,null,{"$f":"\"<\" & A304 & \">\" & TEXT(B304,\"0.000000\") & \"</\" & A304 & \">\"","v":"<A>0.000000</A>"},"Yes","<A>0.000000</A>"]
["Slat_Flag","No",null,{"$f":"\"<\" & A305 & \">\" &IF(B305=\"Yes\",1,0) &\"</\" &A305&\">\"","v":"<Slat_Flag>0</Slat_Flag>"},"Yes","<Slat_Flag>0</Slat_Flag>"]
["Slat_Shear_Flag","No",null,{"$f":"\"<\" & A306 & \">\" &IF(B306=\"Yes\",1,0) &\"</\" &A306&\">\"","v":"<Slat_Shear_Flag>0</Slat_Shear_Flag>"},"Yes","<Slat_Shear_Flag>0</Slat_Shear_Flag>"]
["Slat_Chord",0.25,null,{"$f":"\"<\" & A307 & \">\" & TEXT(B307,\"0.000000\") & \"</\" & A307 & \">\"","v":"<Slat_Chord>0.250000</Slat_Chord>"},"Yes","<Slat_Chord>0.250000</Slat_Chord>"]
["Slat_Angle",10,null,{"$f":"\"<\" & A308 & \">\" & TEXT(B308,\"0.000000\") & \"</\" & A308 & \">\"","v":"<Slat_Angle>10.000000</Slat_Angle>"},"Yes","<Slat_Angle>10.000000</Slat_Angle>"]
["Flap_Flag","Yes",null,{"$f":"\"<\" & A309 & \">\" &IF(B309=\"Yes\",1,0) &\"</\" &A309&\">\"","v":"<Flap_Flag>1</Flap_Flag>"},"Yes","<Flap_Flag>1</Flap_Flag>"]
["Flap_Shear_Flag","No",null,{"$f":"\"<\" & A310 & \">\" &IF(B310=\"Yes\",1,0) &\"</\" &A310&\">\"","v":"<Flap_Shear_Flag>0</Flap_Shear_Flag>"},"Yes","<Flap_Shear_Flag>0</Flap_Shear_Flag>"]
["Flap_Chord",0.42,null,{"$f":"\"<\" & A311 & \">\" & TEXT(B311,\"0.000000\") & \"</\" & A311 & \">\"","v":"<Flap_Chord>0.420000</Flap_Chord>"},"Yes","<Flap_Chord>0.420000</Flap_Chord>"]
["Flap_Angle",10,null,{"$f":"\"<\" & A312 & \">\" & TEXT(B312,\"0.000000\") & \"</\" & A312 & \">\"","v":"<Flap_Angle>10.000000</Flap_Angle>"},"Yes","<Flap_Angle>10.000000</Flap_Angle>"]
["/Airfoil",null,null,{"$f":"\"<\" & A313 & \">\"","v":"</Airfoil>"},"Yes","</Airfoil>"]
["/Airfoil_List",null,null,{"$f":"\"<\" & A314 & \">\"","v":"</Airfoil_List>"},"Yes","</Airfoil_List>"]
["Section_List",null,null,{"$f":"\"<\" & A315 & \">\"","v":"<Section_List>"},"Yes","<Section_List>"]
["Section","Section0",null,{"$f":"\"<\" & A316 & \">\"","v":"<Section>"},"Yes","<Section>"]
["Driver",4,null,{"$f":"\"<\" & A317 & \">\" & TEXT(B317,0) & \"</\" & A317 & \">\"","v":"<Driver>4</Driver>"},"Yes","<Driver>4</Driver>"]
["AR",{"$f":"A_H/2","v":2.5},null,{"$f":"\"<\" & A318 & \">\" & TEXT(B318,\"0.000000\") & \"</\" & A318 & \">\"","v":"<AR>2.500000</AR>"},"Yes","<AR>2.500000</AR>"]
["TR",{"$f":"lam_H","v":0.33},null,"<TR>0.330000</TR>","No","<TR>0.295200</TR>"]
["Area",{"$f":"S_H/2","v":41.405000000000001},null,"<Area>41.405000</Area>","No","<Area>15.500000</Area>"]
["Span",{"$f":"SQRT(B318*B320)","v":10.174109297624044},null,"<Span>10.174109</Span>","No","<Span>6.224950</Span>"]
["TC",{"$f":"B319*B323","v":2.0195224470471782},null,"<TC>2.019522</TC>","No","<TC>1.135025</TC>"]
["RC",{"$f":"(2*B320)/((B319+1)*B321)","v":6.1197649910520555},null,"<RC>6.119765</RC>","No","<RC>3.844935</RC>"]
["Sweep",{"$f":"phi_25.H","v":34.07},null,"<Sweep>34.070000</Sweep>","No","<Sweep>28.000000</Sweep>"]
["SweepLoc",0.25,null,"<SweepLoc>0.250000</SweepLoc>","Yes","<SweepLoc>0.250000</SweepLoc>"]
["Twist",0,null,"<Twist>0.000000</Twist>","Yes","<Twist>0.000000</Twist>"]
["TwistLoc",0,null,"<TwistLoc>0.000000</TwistLoc>",{"$f":"IF(D327=F327,\"Yes\",\"No\")","v":"Yes"},"<TwistLoc>0.000000</TwistLoc>"]
["Dihedral",{"$f":"ggam_H","v":6},null,"<Dihedral>6.000000</Dihedral>","Yes","<Dihedral>6.000000</Dihedral>"]
["Dihed_Crv1",0,null,"<Dihed_Crv1>0.000000</Dihed_Crv1>","Yes","<Dihed_Crv1>0.000000</Dihed_Crv1>"]
["Dihed_Crv2",0,null,"<Dihed_Crv2>0.000000</Dihed_Crv2>","Yes","<Dihed_Crv2>0.000000</Dihed_Crv2>"]
["Dihed_Crv1_Str",0.75,null,"<Dihed_Crv1_Str>0.750000</Dihed_Crv1_Str>","Yes","<Dihed_Crv1_Str>0.750000</Dihed_Crv1_Str>"]
["Dihed_Crv2_Str",0.75,null,"<Dihed_Crv2_Str>0.750000</Dihed_Crv2_Str>","Yes","<Dihed_Crv2_Str>0.750000</Dihed_Crv2_Str>"]
["DihedRotFlag","No",null,{"$f":"\"<\" & A333 & \">\" &IF(B333=\"Yes\",1,0) &\"</\" &A333&\">\"","v":"<DihedRotFlag>0</DihedRotFlag>"},"Yes","<DihedRotFlag>0</DihedRotFlag>"]
["SmoothBlendFlag","No",null,{"$f":"\"<\" & A334 & \">\" &IF(B334=\"Yes\",1,0) &\"</\" &A334&\">\"","v":"<SmoothBlendFlag>0</SmoothBlendFlag>"},"Yes","<SmoothBlendFlag>0</SmoothBlendFlag>"]
["NumInterpXsecs",1,null,{"$f":"\"<\" & A335 & \">\" & TEXT(B335,0) & \"</\" & A335 & \">\"","v":"<NumInterpXsecs>1</NumInterpXsecs>"},"Yes","<NumInterpXsecs>1</NumInterpXsecs>"]
["/Section",null,null,{"$f":"\"<\" & A336 & \">\"","v":"</Section>"},"Yes","</Section>"]
["/Section_List",null,null,{"$f":"\"<\" & A337 & \">\"","v":"</Section_List>"},"Yes","</Section_List>"]
["/Component",null,{"$f":"C209","v":"Yes"},{"$f":"IF(C338=\"Yes\",(\"<\"&A338&\">\"),(\"<\"&A338&\"-->\"))","v":"</Component>"},"Yes","</Component>"]
["Component","VERTICAL TAIL","Yes",{"$f":"IF(C339=\"Yes\",(\"<\"&A339&\">\"),(\"<!--\"&A339&\">\"))","v":"<Component>"},"Yes","<Component>"]
["Type","Mswing",null,{"$f":"\"<\" & A340 & \">\" & TEXT(B340,0) & \"</\" & A340 & \">\"","v":"<Type>Mswing</Type>"},"Yes","<Type>Mswing</Type>"]
["General_Parms",null,null,{"$f":"\"<\" & A341 & \">\"","v":"<General_Parms>"},"Yes","<General_Parms>"]
["Name","VTail",null,{"$f":"\"<\" & A342 & \">\" & TEXT(B342,0) & \"</\" & A342 & \">\"","v":"<Name>VTail</Name>"},"Yes","<Name>VTail</Name>"]
["ColorR",255,null,{"$f":"\"<\" & A343 & \">\" & TEXT(B343,\"0.000000\") & \"</\" & A343 & \">\"","v":"<ColorR>255.000000</ColorR>"},"Yes","<ColorR>255.000000</ColorR>"]
["ColorG",0,null,{"$f":"\"<\" & A344 & \">\" & TEXT(B344,\"0.000000\") & \"</\" & A344 & \">\"","v":"<ColorG>0.000000</ColorG>"},"Yes","<ColorG>0.000000</ColorG>"]
["ColorB",0,null,{"$f":"\"<\" & A345 & \">\" & TEXT(B345,\"0.000000\") & \"</\" & A345 & \">\"","v":"<ColorB>0.000000</ColorB>"},"Yes","<ColorB>0.000000</ColorB>"]
["Symmetry",0,null,{"$f":"\"<\" & A346 & \">\" & TEXT(B346,0) & \"</\" & A346 & \">\"","v":"<Symmetry>0</Symmetry>"},"Yes","<Symmetry>0</Symmetry>"]
["RelXFormFlag","No",null,{"$f":"\"<\" & A347 & \">\" &IF(B347=\"Yes\",1,0) &\"</\" &A347&\">\"","v":"<RelXFormFlag>0</RelXFormFlag>"},"Yes","<RelXFormFlag>0</RelXFormFlag>"]
["MaterialID",1,null,{"$f":"\"<\" & A348 & \">\" & TEXT(B348,0) & \"</\" & A348 & \">\"","v":"<MaterialID>1</MaterialID>"},"Yes","<MaterialID>1</MaterialID>"]
["OutputFlag","Yes",null,{"$f":"\"<\" & A349 & \">\" &IF(B349=\"Yes\",1,0) &\"</\" &A349&\">\"","v":"<OutputFlag>1</OutputFlag>"},"Yes","<OutputFlag>1</OutputFlag>"]
["OutputNameID",0,null,{"$f":"\"<\" & A350 & \">\" & TEXT(B350,0) & \"</\" & A350 & \">\"","v":"<OutputNameID>0</OutputNameID>"},"Yes","<OutputNameID>0</OutputNameID>"]
["DisplayChildrenFlag","Yes",null,{"$f":"\"<\" & A351 & \">\" &IF(B351=\"Yes\",1,0) &\"</\" &A351&\">\"","v":"<DisplayChildrenFlag>1</DisplayChildrenFlag>"},"Yes","<DisplayChildrenFlag>1</DisplayChildrenFlag>"]
["NumPnts",21,null,{"$f":"\"<\" & A352 & \">\" & TEXT(B352,0) & \"</\" & A352 & \">\"","v":"<NumPnts>21</NumPnts>"},"Yes","<NumPnts>21</NumPnts>"]
["NumXsecs",6,null,{"$f":"\"<\" & A353 & \">\" & TEXT(B353,0) & \"</\" & A353 & \">\"","v":"<NumXsecs>6</NumXsecs>"},"Yes","<NumXsecs>6</NumXsecs>"]
["MassPrior",0,null,{"$f":"\"<\" & A354 & \">\" & TEXT(B354,0) & \"</\" & A354 & \">\"","v":"<MassPrior>0</MassPrior>"},"Yes","<MassPrior>0</MassPrior>"]
["ShellFlag","No",null,{"$f":"\"<\" & A355 & \">\" &IF(B355=\"Yes\",1,0) &\"</\" &A355&\">\"","v":"<ShellFlag>0</ShellFlag>"},"Yes","<ShellFlag>0</ShellFlag>"]
["Tran_X",{"$f":"pos_V.x","v":47.8142},null,{"$f":"\"<\" & A356 & \">\" & TEXT(B356,\"0.000000\") & \"</\" & A356 & \">\"","v":"<Tran_X>47.814200</Tran_X>"},"No","<Tran_X>27.387000</Tran_X>"]
["Tran_Y",{"$f":"pos_V.y","v":0},null,"<Tran_Y>0.000000</Tran_Y>","Yes","<Tran_Y>0.000000</Tran_Y>"]
["Tran_Z",{"$f":"pos_V.z","v":2.9155000000000002},null,"<Tran_Z>2.915500</Tran_Z>","No","<Tran_Z>1.980000</Tran_Z>"]
["TranRel_X",0,null,"<TranRel_X>0.000000</TranRel_X>","Yes","<TranRel_X>0.000000</TranRel_X>"]
["TranRel_Y",0,null,"<TranRel_Y>0.000000</TranRel_Y>","Yes","<TranRel_Y>0.000000</TranRel_Y>"]
["TranRel_Z",0,null,"<TranRel_Z>0.000000</TranRel_Z>","Yes","<TranRel_Z>0.000000</TranRel_Z>"]
["Rot_X",90,null,"<Rot_X>90.000000</Rot_X>","Yes","<Rot_X>90.000000</Rot_X>"]
["Rot_Y",0,null,"<Rot_Y>0.000000</Rot_Y>","Yes","<Rot_Y>0.000000</Rot_Y>"]
["Rot_Z",0,null,"<Rot_Z>0.000000</Rot_Z>","Yes","<Rot_Z>0.000000</Rot_Z>"]
["RotRel_X",0,null,"<RotRel_X>0.000000</RotRel_X>","Yes","<RotRel_X>0.000000</RotRel_X>"]
["RotRel_Y",0,null,"<RotRel_Y>0.000000</RotRel_Y>","Yes","<RotRel_Y>0.000000</RotRel_Y>"]
["RotRel_Z",0,null,"<RotRel_Z>0.000000</RotRel_Z>","Yes","<RotRel_Z>0.000000</RotRel_Z>"]
["Origin",0,null,"<Origin>0.000000</Origin>","Yes","<Origin>0.000000</Origin>"]
["Density",1,null,"<Density>1.000000</Density>","Yes","<Density>1.000000</Density>"]
["ShellMassArea",1,null,"<ShellMassArea>1.000000</ShellMassArea>","Yes","<ShellMassArea>1.000000</ShellMassArea>"]
["RefFlag","No",null,{"$f":"\"<\" & A371 & \">\" &IF(B371=\"Yes\",1,0) &\"</\" &A371&\">\"","v":"<RefFlag>0</RefFlag>"},"Yes","<RefFlag>0</RefFlag>"]
["RefArea",100,null,{"$f":"\"<\" & A372 & \">\" & TEXT(B372,\"0.000000\") & \"</\" & A372 & \">\"","v":"<RefArea>100.000000</RefArea>"},"Yes","<RefArea>100.000000</RefArea>"]
["RefSpan",10,null,{"$f":"\"<\" & A373 & \">\" & TEXT(B373,\"0.000000\") & \"</\" & A373 & \">\"","v":"<RefSpan>10.000000</RefSpan>"},"Yes","<RefSpan>10.000000</RefSpan>"]
["RefCbar",1,null,{"$f":"\"<\" & A374 & \">\" & TEXT(B374,\"0.000000\") & \"</\" & A374 & \">\"","v":"<RefCbar>1.000000</RefCbar>"},"Yes","<RefCbar>1.000000</RefCbar>"]
["AutoRefAreaFlag","Yes",null,{"$f":"\"<\" & A375 & \">\" &IF(B375=\"Yes\",1,0) &\"</\" &A375&\">\"","v":"<AutoRefAreaFlag>1</AutoRefAreaFlag>"},"Yes","<AutoRefAreaFlag>1</AutoRefAreaFlag>"]
["AutoRefSpanFlag","Yes",null,{"$f":"\"<\" & A376 & \">\" &IF(B376=\"Yes\",1,0) &\"</\" &A376&\">\"","v":"<AutoRefSpanFlag>1</AutoRefSpanFlag>"},"Yes","<AutoRefSpanFlag>1</AutoRefSpanFlag>"]
["AutoRefCbarFlag","Yes",null,{"$f":"\"<\" & A377 & \">\" &IF(B377=\"Yes\",1,0) &\"</\" &A377&\">\"","v":"<AutoRefCbarFlag>1</AutoRefCbarFlag>"},"Yes","<AutoRefCbarFlag>1</AutoRefCbarFlag>"]
["AeroCenter_X",0,null,{"$f":"\"<\" & A378 & \">\" & TEXT(B378,\"0.000000\") & \"</\" & A378 & \">\"","v":"<AeroCenter_X>0.000000</AeroCenter_X>"},"Yes","<AeroCenter_X>0.000000</AeroCenter_X>"]
["AeroCenter_Y",0,null,{"$f":"\"<\" & A379 & \">\" & TEXT(B379,\"0.000000\") & \"</\" & A379 & \">\"","v":"<AeroCenter_Y>0.000000</AeroCenter_Y>"},"Yes","<AeroCenter_Y>0.000000</AeroCenter_Y>"]
["AeroCenter_Z",0,null,{"$f":"\"<\" & A380 & \">\" & TEXT(B380,\"0.000000\") & \"</\" & A380 & \">\"","v":"<AeroCenter_Z>0.000000</AeroCenter_Z>"},"Yes","<AeroCenter_Z>0.000000</AeroCenter_Z>"]
["AutoAeroCenterFlag","Yes",null,{"$f":"\"<\" & A381 & \">\" &IF(B381=\"Yes\",1,0) &\"</\" &A381&\">\"","v":"<AutoAeroCenterFlag>1</AutoAeroCenterFlag>"},"Yes","<AutoAeroCenterFlag>1</AutoAeroCenterFlag>"]
["WakeActiveFlag","No",null,{"$f":"\"<\" & A382 & \">\" &IF(B382=\"Yes\",1,0) &\"</\" &A382&\">\"","v":"<WakeActiveFlag>0</WakeActiveFlag>"},"Yes","<WakeActiveFlag>0</WakeActiveFlag>"]
["PosAttachFlag","No",null,{"$f":"\"<\" & A383 & \">\" &IF(B383=\"Yes\",1,0) &\"</\" &A383&\">\"","v":"<PosAttachFlag>0</PosAttachFlag>"},"Yes","<PosAttachFlag>0</PosAttachFlag>"]
["U_Attach",0,null,{"$f":"\"<\" & A384 & \">\" & TEXT(B384,\"0.000000\") & \"</\" & A384 & \">\"","v":"<U_Attach>0.000000</U_Attach>"},"Yes","<U_Attach>0.000000</U_Attach>"]
["V_Attach",0,null,{"$f":"\"<\" & A385 & \">\" & TEXT(B385,\"0.000000\") & \"</\" & A385 & \">\"","v":"<V_Attach>0.000000</V_Attach>"},"Yes","<V_Attach>0.000000</V_Attach>"]
["PtrID",148251000,null,{"$f":"\"<\" & A386 & \">\" & TEXT(B386,0) & \"</\" & A386 & \">\"","v":"<PtrID>148251000</PtrID>"},"Yes","<PtrID>148251000</PtrID>"]
["Parent_PtrID",0,null,{"$f":"\"<\" & A387 & \">\" & TEXT(B387,0) & \"</\" & A387 & \">\"","v":"<Parent_PtrID>0</Parent_PtrID>"},"Yes","<Parent_PtrID>0</Parent_PtrID>"]
["/General_Parms",null,null,{"$f":"\"<\" & A388 & \">\"","v":"</General_Parms>"},"Yes","</General_Parms>"]
["Mswing_Parms",null,null,{"$f":"\"<\" & A389 & \">\"","v":"<Mswing_Parms>"},"Yes","<Mswing_Parms>"]
["Total_Area",{"$f":"B492+B471","v":55.07},null,{"$f":"\"<\" & A390 & \">\" & TEXT(B390,\"0.000000\") & \"</\" & A390 & \">\"","v":"<Total_Area>55.070000</Total_Area>"},"No","<Total_Area>21.510000</Total_Area>"]
["Total_Span",{"$f":"B493+B472","v":9.386799241488017},null,{"$f":"\"<\" & A391 & \">\" & TEXT(B391,\"0.000000\") & \"</\" & A391 & \">\"","v":"<Total_Span>9.386799</Total_Span>"},{"$f":"IF(D391=F391,\"Yes\",\"No\")","v":"No"},"<Total_Span>5.870181</Total_Span>"]
["Total_Proj_Span",{"$f":"B472*COS(B479*PI()/180) + B493*COS(B500*PI()/180)","v":9.386799241488017},null,{"$f":"\"<\" & A392 & \">\" & TEXT(B392,\"0.000000\") & \"</\" & A392 & \">\"","v":"<Total_Proj_Span>9.386799</Total_Proj_Span>"},"No","<Total_Proj_Span>5.870181</Total_Proj_Span>"]
["Avg_Chord",{"$f":"(B471/B472 + B492/B493)/2","v":5.8667495259300093},null,{"$f":"\"<\" & A393 & \">\" & TEXT(B393,\"0.000000\") & \"</\" & A393 & \">\"","v":"<Avg_Chord>5.866750</Avg_Chord>"},"No","<Avg_Chord>3.664283</Avg_Chord>"]
["Sweep_Off",0,null,{"$f":"\"<\" & A394 & \">\" & TEXT(B394,\"0.000000\") & \"</\" & A394 & \">\"","v":"<Sweep_Off>0.000000</Sweep_Off>"},"Yes","<Sweep_Off>0.000000</Sweep_Off>"]
["Deg_Per_Seg",9,null,{"$f":"\"<\" & A395 & \">\" & TEXT(B395,0) & \"</\" & A395 & \">\"","v":"<Deg_Per_Seg>9</Deg_Per_Seg>"},"Yes","<Deg_Per_Seg>9</Deg_Per_Seg>"]
["Max_Num_Seg",9,null,{"$f":"\"<\" & A396 & \">\" & TEXT(B396,0) & \"</\" & A396 & \">\"","v":"<Max_Num_Seg>9</Max_Num_Seg>"},"Yes","<Max_Num_Seg>9</Max_Num_Seg>"]
["Rel_Dihedral_Flag","No",null,{"$f":"\"<\" & A397 & \">\" &IF(B397=\"Yes\",1,0) &\"</\" &A397&\">\"","v":"<Rel_Dihedral_Flag>0</Rel_Dihedral_Flag>"},"Yes","<Rel_Dihedral_Flag>0</Rel_Dihedral_Flag>"]
["Rel_Twist_Flag","No",null,{"$f":"\"<\" & A398 & \">\" &IF(B398=\"Yes\",1,0) &\"</\" &A398&\">\"","v":"<Rel_Twist_Flag>0</Rel_Twist_Flag>"},"Yes","<Rel_Twist_Flag>0</Rel_Twist_Flag>"]
["Round_End_Cap_Flag","No",null,{"$f":"\"<\" & A399 & \">\" &IF(B399=\"Yes\",1,0) &\"</\" &A399&\">\"","v":"<Round_End_Cap_Flag>0</Round_End_Cap_Flag>"},"Yes","<Round_End_Cap_Flag>0</Round_End_Cap_Flag>"]
["/Mswing_Parms",null,null,{"$f":"\"<\" & A400 & \">\"","v":"</Mswing_Parms>"},"Yes","</Mswing_Parms>"]
["Airfoil_List",null,null,{"$f":"\"<\" & A401 & \">\"","v":"<Airfoil_List>"},"Yes","<Airfoil_List>"]
["Airfoil","Airfoil0",null,{"$f":"\"<\" & A402 & \">\"","v":"<Airfoil>"},"Yes","<Airfoil>"]
["Type",1,null,{"$f":"\"<\" & A403 & \">\" & TEXT(B403,0) & \"</\" & A403 & \">\"","v":"<Type>1</Type>"},"Yes","<Type>1</Type>"]
["Inverted_Flag","No",null,{"$f":"\"<\" & A404 & \">\" &IF(B404=\"Yes\",1,0) &\"</\" &A404&\">\"","v":"<Inverted_Flag>0</Inverted_Flag>"},"Yes","<Inverted_Flag>0</Inverted_Flag>"]
["Camber",0,null,{"$f":"\"<\" & A405 & \">\" & TEXT(B405,\"0.000000\") & \"</\" & A405 & \">\"","v":"<Camber>0.000000</Camber>"},"Yes","<Camber>0.000000</Camber>"]
["Camber_Loc",0.1,null,"<Camber_Loc>0.100000</Camber_Loc>","Yes","<Camber_Loc>0.100000</Camber_Loc>"]
["Thickness",0.1,null,"<Thickness>0.100000</Thickness>","Yes","<Thickness>0.100000</Thickness>"]
["Thickness_Loc",0.3,null,"<Thickness_Loc>0.300000</Thickness_Loc>","Yes","<Thickness_Loc>0.300000</Thickness_Loc>"]
["Radius_Le",1.1018999999999999E-2,null,"<Radius_Le>0.011019</Radius_Le>","Yes","<Radius_Le>0.011019</Radius_Le>"]
["Radius_Te",0,null,"<Radius_Te>0.000000</Radius_Te>","Yes","<Radius_Te>0.000000</Radius_Te>"]
["Six_Series",63,null,{"$f":"\"<\" & A411 & \">\" & TEXT(B411,0) & \"</\" & A411 & \">\"","v":"<Six_Series>63</Six_Series>"},"Yes","<Six_Series>63</Six_Series>"]
["Ideal_Cl",0,null,{"$f":"\"<\" & A412 & \">\" & TEXT(B412,\"0.000000\") & \"</\" & A412 & \">\"","v":"<Ideal_Cl>0.000000</Ideal_Cl>"},"Yes","<Ideal_Cl>0.000000</Ideal_Cl>"]
["A",0,null,{"$f":"\"<\" & A413 & \">\" & TEXT(B413,\"0.000000\") & \"</\" & A413 & \">\"","v":"<A>0.000000</A>"},"Yes","<A>0.000000</A>"]
["Slat_Flag","No",null,{"$f":"\"<\" & A414 & \">\" &IF(B414=\"Yes\",1,0) &\"</\" &A414&\">\"","v":"<Slat_Flag>0</Slat_Flag>"},"Yes","<Slat_Flag>0</Slat_Flag>"]
["Slat_Shear_Flag","No",null,{"$f":"\"<\" & A415 & \">\" &IF(B415=\"Yes\",1,0) &\"</\" &A415&\">\"","v":"<Slat_Shear_Flag>0</Slat_Shear_Flag>"},"Yes","<Slat_Shear_Flag>0</Slat_Shear_Flag>"]
["Slat_Chord",0.25,null,{"$f":"\"<\" & A416 & \">\" & TEXT(B416,\"0.000000\") & \"</\" & A416 & \">\"","v":"<Slat_Chord>0.250000</Slat_Chord>"},"Yes","<Slat_Chord>0.250000</Slat_Chord>"]
["Slat_Angle",10,null,{"$f":"\"<\" & A417 & \">\" & TEXT(B417,\"0.000000\") & \"</\" & A417 & \">\"","v":"<Slat_Angle>10.000000</Slat_Angle>"},"Yes","<Slat_Angle>10.000000</Slat_Angle>"]
["Flap_Flag","Yes",null,{"$f":"\"<\" & A418 & \">\" &IF(B418=\"Yes\",1,0) &\"</\" &A418&\">\"","v":"<Flap_Flag>1</Flap_Flag>"},"Yes","<Flap_Flag>1</Flap_Flag>"]
["Flap_Shear_Flag","No",null,{"$f":"\"<\" & A419 & \">\" &IF(B419=\"Yes\",1,0) &\"</\" &A419&\">\"","v":"<Flap_Shear_Flag>0</Flap_Shear_Flag>"},"Yes","<Flap_Shear_Flag>0</Flap_Shear_Flag>"]
["Flap_Chord",0.31,null,{"$f":"\"<\" & A420 & \">\" & TEXT(B420,\"0.000000\") & \"</\" & A420 & \">\"","v":"<Flap_Chord>0.310000</Flap_Chord>"},"Yes","<Flap_Chord>0.310000</Flap_Chord>"]
["Flap_Angle",10,null,{"$f":"\"<\" & A421 & \">\" & TEXT(B421,\"0.000000\") & \"</\" & A421 & \">\"","v":"<Flap_Angle>10.000000</Flap_Angle>"},"Yes","<Flap_Angle>10.000000</Flap_Angle>"]
["/Airfoil",null,null,{"$f":"\"<\" & A422 & \">\"","v":"</Airfoil>"},"Yes","</Airfoil>"]
["Airfoil","Airfoil1",null,{"$f":"\"<\" & A423 & \">\"","v":"<Airfoil>"},"Yes","<Airfoil>"]
["Type",1,null,{"$f":"\"<\" & A424 & \">\" & TEXT(B424,0) & \"</\" & A424 & \">\"","v":"<Type>1</Type>"},"Yes","<Type>1</Type>"]
["Inverted_Flag","No",null,{"$f":"\"<\" & A425 & \">\" &IF(B425=\"Yes\",1,0) &\"</\" &A425&\">\"","v":"<Inverted_Flag>0</Inverted_Flag>"},"Yes","<Inverted_Flag>0</Inverted_Flag>"]
["Camber",0,null,{"$f":"\"<\" & A426 & \">\" & TEXT(B426,\"0.000000\") & \"</\" & A426 & \">\"","v":"<Camber>0.000000</Camber>"},"Yes","<Camber>0.000000</Camber>"]
["Camber_Loc",0.1,null,"<Camber_Loc>0.100000</Camber_Loc>","Yes","<Camber_Loc>0.100000</Camber_Loc>"]
["Thickness",0.1,null,"<Thickness>0.100000</Thickness>","Yes","<Thickness>0.100000</Thickness>"]
["Thickness_Loc",0.3,null,"<Thickness_Loc>0.300000</Thickness_Loc>","Yes","<Thickness_Loc>0.300000</Thickness_Loc>"]
["Radius_Le",1.1018999999999999E-2,null,"<Radius_Le>0.011019</Radius_Le>","Yes","<Radius_Le>0.011019</Radius_Le>"]
["Radius_Te",0,null,"<Radius_Te>0.000000</Radius_Te>","Yes","<Radius_Te>0.000000</Radius_Te>"]
["Six_Series",63,null,{"$f":"\"<\" & A432 & \">\" & TEXT(B432,0) & \"</\" & A432 & \">\"","v":"<Six_Series>63</Six_Series>"},"Yes","<Six_Series>63</Six_Series>"]
["Ideal_Cl",0,null,{"$f":"\"<\" & A433 & \">\" & TEXT(B433,\"0.000000\") & \"</\" & A433 & \">\"","v":"<Ideal_Cl>0.000000</Ideal_Cl>"},"Yes","<Ideal_Cl>0.000000</Ideal_Cl>"]
["A",0,null,{"$f":"\"<\" & A434 & \">\" & TEXT(B434,\"0.000000\") & \"</\" & A434 & \">\"","v":"<A>0.000000</A>"},"Yes","<A>0.000000</A>"]
["Slat_Flag","No",null,{"$f":"\"<\" & A435 & \">\" &IF(B435=\"Yes\",1,0) &\"</\" &A435&\">\"","v":"<Slat_Flag>0</Slat_Flag>"},"Yes","<Slat_Flag>0</Slat_Flag>"]
["Slat_Shear_Flag","No",null,{"$f":"\"<\" & A436 & \">\" &IF(B436=\"Yes\",1,0) &\"</\" &A436&\">\"","v":"<Slat_Shear_Flag>0</Slat_Shear_Flag>"},"Yes","<Slat_Shear_Flag>0</Slat_Shear_Flag>"]
["Slat_Chord",0.25,null,{"$f":"\"<\" & A437 & \">\" & TEXT(B437,\"0.000000\") & \"</\" & A437 & \">\"","v":"<Slat_Chord>0.250000</Slat_Chord>"},"Yes","<Slat_Chord>0.250000</Slat_Chord>"]
["Slat_Angle",10,null,{"$f":"\"<\" & A438 & \">\" & TEXT(B438,\"0.000000\") & \"</\" & A438 & \">\"","v":"<Slat_Angle>10.000000</Slat_Angle>"},"Yes","<Slat_Angle>10.000000</Slat_Angle>"]
["Flap_Flag","Yes",null,{"$f":"\"<\" & A439 & \">\" &IF(B439=\"Yes\",1,0) &\"</\" &A439&\">\"","v":"<Flap_Flag>1</Flap_Flag>"},"Yes","<Flap_Flag>1</Flap_Flag>"]
["Flap_Shear_Flag","No",null,{"$f":"\"<\" & A440 & \">\" &IF(B440=\"Yes\",1,0) &\"</\" &A440&\">\"","v":"<Flap_Shear_Flag>0</Flap_Shear_Flag>"},"Yes","<Flap_Shear_Flag>0</Flap_Shear_Flag>"]
["Flap_Chord",0.31,null,{"$f":"\"<\" & A441 & \">\" & TEXT(B441,\"0.000000\") & \"</\" & A441 & \">\"","v":"<Flap_Chord>0.310000</Flap_Chord>"},"Yes","<Flap_Chord>0.310000</Flap_Chord>"]
["Flap_Angle",10,null,{"$f":"\"<\" & A442 & \">\" & TEXT(B442,\"0.000000\") & \"</\" & A442 & \">\"","v":"<Flap_Angle>10.000000</Flap_Angle>"},"Yes","<Flap_Angle>10.000000</Flap_Angle>"]
["/Airfoil",null,null,{"$f":"\"<\" & A443 & \">\"","v":"</Airfoil>"},"Yes","</Airfoil>"]
["Airfoil","Airfoil2",null,{"$f":"\"<\" & A444 & \">\"","v":"<Airfoil>"},"Yes","<Airfoil>"]
["Type",1,null,{"$f":"\"<\" & A445 & \">\" & TEXT(B445,0) & \"</\" & A445 & \">\"","v":"<Type>1</Type>"},"Yes","<Type>1</Type>"]
["Inverted_Flag","No",null,{"$f":"\"<\" & A446 & \">\" &IF(B446=\"Yes\",1,0) &\"</\" &A446&\">\"","v":"<Inverted_Flag>0</Inverted_Flag>"},"Yes","<Inverted_Flag>0</Inverted_Flag>"]
["Camber",0,null,{"$f":"\"<\" & A447 & \">\" & TEXT(B447,\"0.000000\") & \"</\" & A447 & \">\"","v":"<Camber>0.000000</Camber>"},"Yes","<Camber>0.000000</Camber>"]
["Camber_Loc",0.1,null,"<Camber_Loc>0.100000</Camber_Loc>","Yes","<Camber_Loc>0.100000</Camber_Loc>"]
["Thickness",0.1,null,"<Thickness>0.100000</Thickness>","Yes","<Thickness>0.100000</Thickness>"]
["Thickness_Loc",0.3,null,"<Thickness_Loc>0.300000</Thickness_Loc>","Yes","<Thickness_Loc>0.300000</Thickness_Loc>"]
["Radius_Le",1.1018999999999999E-2,null,"<Radius_Le>0.011019</Radius_Le>","Yes","<Radius_Le>0.011019</Radius_Le>"]
["Radius_Te",0,null,"<Radius_Te>0.000000</Radius_Te>","Yes","<Radius_Te>0.000000</Radius_Te>"]
["Six_Series",63,null,{"$f":"\"<\" & A453 & \">\" & TEXT(B453,0) & \"</\" & A453 & \">\"","v":"<Six_Series>63</Six_Series>"},"Yes","<Six_Series>63</Six_Series>"]
["Ideal_Cl",0,null,{"$f":"\"<\" & A454 & \">\" & TEXT(B454,\"0.000000\") & \"</\" & A454 & \">\"","v":"<Ideal_Cl>0.000000</Ideal_Cl>"},"Yes","<Ideal_Cl>0.000000</Ideal_Cl>"]
["A",0,null,{"$f":"\"<\" & A455 & \">\" & TEXT(B455,\"0.000000\") & \"</\" & A455 & \">\"","v":"<A>0.000000</A>"},{"$f":"IF(D455=F455,\"Yes\",\"No\")","v":"Yes"},"<A>0.000000</A>"]
["Slat_Flag","No",null,{"$f":"\"<\" & A456 & \">\" &IF(B456=\"Yes\",1,0) &\"</\" &A456&\">\"","v":"<Slat_Flag>0</Slat_Flag>"},"Yes","<Slat_Flag>0</Slat_Flag>"]
["Slat_Shear_Flag","No",null,{"$f":"\"<\" & A457 & \">\" &IF(B457=\"Yes\",1,0) &\"</\" &A457&\">\"","v":"<Slat_Shear_Flag>0</Slat_Shear_Flag>"},"Yes","<Slat_Shear_Flag>0</Slat_Shear_Flag>"]
["Slat_Chord",0.25,null,{"$f":"\"<\" & A458 & \">\" & TEXT(B458,\"0.000000\") & \"</\" & A458 & \">\"","v":"<Slat_Chord>0.250000</Slat_Chord>"},"Yes","<Slat_Chord>0.250000</Slat_Chord>"]
["Slat_Angle",10,null,{"$f":"\"<\" & A459 & \">\" & TEXT(B459,\"0.000000\") & \"</\" & A459 & \">\"","v":"<Slat_Angle>10.000000</Slat_Angle>"},"Yes","<Slat_Angle>10.000000</Slat_Angle>"]
["Flap_Flag","Yes",null,{"$f":"\"<\" & A460 & \">\" &IF(B460=\"Yes\",1,0) &\"</\" &A460&\">\"","v":"<Flap_Flag>1</Flap_Flag>"},"Yes","<Flap_Flag>1</Flap_Flag>"]
["Flap_Shear_Flag","No",null,{"$f":"\"<\" & A461 & \">\" &IF(B461=\"Yes\",1,0) &\"</\" &A461&\">\"","v":"<Flap_Shear_Flag>0</Flap_Shear_Flag>"},"Yes","<Flap_Shear_Flag>0</Flap_Shear_Flag>"]
["Flap_Chord",0.31,null,{"$f":"\"<\" & A462 & \">\" & TEXT(B462,\"0.000000\") & \"</\" & A462 & \">\"","v":"<Flap_Chord>0.310000</Flap_Chord>"},"Yes","<Flap_Chord>0.310000</Flap_Chord>"]
["Flap_Angle",10,null,{"$f":"\"<\" & A463 & \">\" & TEXT(B463,\"0.000000\") & \"</\" & A463 & \">\"","v":"<Flap_Angle>10.000000</Flap_Angle>"},"Yes","<Flap_Angle>10.000000</Flap_Angle>"]
["/Airfoil",null,null,{"$f":"\"<\" & A464 & \">\"","v":"</Airfoil>"},"Yes","</Airfoil>"]
["/Airfoil_List",null,null,{"$f":"\"<\" & A465 & \">\"","v":"</Airfoil_List>"},"Yes","</Airfoil_List>"]
["Section_List",null,null,{"$f":"\"<\" & A466 & \">\"","v":"<Section_List>"},"Yes","<Section_List>"]
["Section","Section0",null,{"$f":"\"<\" & A467 & \">\"","v":"<Section>"},"Yes","<Section>"]
["Driver",4,null,{"$f":"\"<\" & A468 & \">\" & TEXT(B468,0) & \"</\" & A468 & \">\"","v":"<Driver>4</Driver>"},"Yes","<Driver>4</Driver>"]
["AR",{"$f":"(B472^2)/B471","v":0.64761904761904765},null,{"$f":"\"<\" & A469 & \">\" & TEXT(B469,\"0.000000\") & \"</\" & A469 & \">\"","v":"<AR>0.647619</AR>"},"No","<AR>0.631091</AR>"]
["TR",{"$f":"B473/B474","v":0.67999999999999983},null,"<TR>0.680000</TR>","No","<TR>0.650000</TR>"]
["Area",{"$f":"0.5*(B473+B474)*B472","v":34.013823529411766},null,"<Area>34.013824</Area>","No","<Area>13.650577</Area>"]
["Span",{"$f":"IF(Type_df = \"No\", b_V/2, b_df)","v":4.6933996207440085},null,"<Span>4.693400</Span>","No","<Span>2.935090</Span>"]
["TC",{"$f":"c_r.V + IF(Type_df = \"No\", (b_V/2), b_df)*(TAN(phi_100.V*PI()/180) - TAN(phi_0.V*PI()/180))","v":5.8667495259300093},null,"<TC>5.866750</TC>","No","<TC>3.664283</TC>"]
["RC",{"$f":"IF(Type_df = \"No\", c_r.V, c_r.V+c_r.df)","v":8.6275728322500154},null,"<RC>8.627573</RC>","No","<RC>5.637358</RC>"]
["Sweep",{"$f":"phi_100.V","v":29.197486046064462},null,"<Sweep>29.197486</Sweep>","No","<Sweep>11.091055</Sweep>"]
["SweepLoc",1,null,"<SweepLoc>1.000000</SweepLoc>","Yes","<SweepLoc>1.000000</SweepLoc>"]
["Twist",0,null,{"$f":"\"<\" & A477 & \">\" & TEXT(B498,\"0.000000\") & \"</\" & A477 & \">\"","v":"<Twist>0.000000</Twist>"},"Yes","<Twist>0.000000</Twist>"]
["TwistLoc",0,null,"<TwistLoc>0.000000</TwistLoc>","Yes","<TwistLoc>0.000000</TwistLoc>"]
["Dihedral",0,null,"<Dihedral>0.000000</Dihedral>","Yes","<Dihedral>0.000000</Dihedral>"]
["Dihed_Crv1",0,null,"<Dihed_Crv1>0.000000</Dihed_Crv1>","Yes","<Dihed_Crv1>0.000000</Dihed_Crv1>"]
["Dihed_Crv2",0,null,"<Dihed_Crv2>0.000000</Dihed_Crv2>","Yes","<Dihed_Crv2>0.000000</Dihed_Crv2>"]
["Dihed_Crv1_Str",0.75,null,"<Dihed_Crv1_Str>0.750000</Dihed_Crv1_Str>","Yes","<Dihed_Crv1_Str>0.750000</Dihed_Crv1_Str>"]
["Dihed_Crv2_Str",0.75,null,"<Dihed_Crv2_Str>0.750000</Dihed_Crv2_Str>","Yes","<Dihed_Crv2_Str>0.750000</Dihed_Crv2_Str>"]
["DihedRotFlag","No",null,{"$f":"\"<\" & A484 & \">\" &IF(B505=\"Yes\",1,0) &\"</\" &A484&\">\"","v":"<DihedRotFlag>0</DihedRotFlag>"},"Yes","<DihedRotFlag>0</DihedRotFlag>"]
["SmoothBlendFlag","No",null,{"$f":"\"<\" & A485 & \">\" &IF(B506=\"Yes\",1,0) &\"</\" &A485&\">\"","v":"<SmoothBlendFlag>0</SmoothBlendFlag>"},"Yes","<SmoothBlendFlag>0</SmoothBlendFlag>"]
["NumInterpXsecs",1,null,{"$f":"\"<\" & A486 & \">\" & TEXT(B507,0) & \"</\" & A486 & \">\"","v":"<NumInterpXsecs>1</NumInterpXsecs>"},"Yes","<NumInterpXsecs>1</NumInterpXsecs>"]
["/Section",null,null,{"$f":"\"<\" & A487 & \">\"","v":"</Section>"},"Yes","</Section>"]
["Section","Section1",null,{"$f":"\"<\" & A488 & \">\"","v":"<Section>"},"Yes","<Section>"]
["Driver",4,null,{"$f":"\"<\" & A489 & \">\" & TEXT(B489,0) & \"</\" & A489 & \">\"","v":"<Driver>4</Driver>"},"Yes","<Driver>4</Driver>"]
["AR",{"$f":"(B493^2)/B492","v":1.0461538461538464},null,{"$f":"\"<\" & A490 & \">\" & TEXT(B490,\"0.000000\") & \"</\" & A490 & \">\"","v":"<AR>1.046154</AR>"},"No","<AR>1.096105</AR>"]
["TR",{"$f":"B494/B495","v":0.52941176470588247},null,"<TR>0.529412</TR>","No","<TR>0.461538</TR>"]
["Area",{"$f":"0.5*(B494+B495)*B493","v":21.056176470588234},null,"<Area>21.056176</Area>","No","<Area>7.859423</Area>"]
["Span",{"$f":"IF(Type_df = \"No\", b_V/2, b_V-b_df)","v":4.6933996207440085},null,"<Span>4.693400</Span>","No","<Span>2.935090</Span>"]
["TC",{"$f":"c_t.V","v":3.1059262196100055},null,"<TC>3.105926</TC>","No","<TC>1.691207</TC>"]
["RC",{"$f":"B473","v":5.8667495259300093},null,"<RC>5.866750</RC>","No","<RC>3.664283</RC>"]
["Sweep",{"$f":"phi_25.V","v":45},null,"<Sweep>45.000000</Sweep>","No","<Sweep>35.000000</Sweep>"]
["SweepLoc",0.25,null,"<SweepLoc>0.250000</SweepLoc>","Yes","<SweepLoc>0.250000</SweepLoc>"]
["Twist",0,null,"<Twist>0.000000</Twist>","Yes","<Twist>0.000000</Twist>"]
["TwistLoc",0,null,"<TwistLoc>0.000000</TwistLoc>","Yes","<TwistLoc>0.000000</TwistLoc>"]
["Dihedral",0,null,"<Dihedral>0.000000</Dihedral>","Yes","<Dihedral>0.000000</Dihedral>"]
["Dihed_Crv1",0,null,"<Dihed_Crv1>0.000000</Dihed_Crv1>","Yes","<Dihed_Crv1>0.000000</Dihed_Crv1>"]
["Dihed_Crv2",0,null,"<Dihed_Crv2>0.000000</Dihed_Crv2>","Yes","<Dihed_Crv2>0.000000</Dihed_Crv2>"]
["Dihed_Crv1_Str",0.75,null,"<Dihed_Crv1_Str>0.750000</Dihed_Crv1_Str>","Yes","<Dihed_Crv1_Str>0.750000</Dihed_Crv1_Str>"]
["Dihed_Crv2_Str",0.75,null,"<Dihed_Crv2_Str>0.750000</Dihed_Crv2_Str>","Yes","<Dihed_Crv2_Str>0.750000</Dihed_Crv2_Str>"]
["DihedRotFlag","No",null,{"$f":"\"<\" & A505 & \">\" &IF(B526=\"Yes\",1,0) &\"</\" &A505&\">\"","v":"<DihedRotFlag>0</DihedRotFlag>"},"Yes","<DihedRotFlag>0</DihedRotFlag>"]
["SmoothBlendFlag","No",null,{"$f":"\"<\" & A506 & \">\" &IF(B527=\"Yes\",1,0) &\"</\" &A506&\">\"","v":"<SmoothBlendFlag>0</SmoothBlendFlag>"},"Yes","<SmoothBlendFlag>0</SmoothBlendFlag>"]
["NumInterpXsecs",1,null,{"$f":"\"<\" & A507 & \">\" & TEXT(B507,0) & \"</\" & A507 & \">\"","v":"<NumInterpXsecs>1</NumInterpXsecs>"},"Yes","<NumInterpXsecs>1</NumInterpXsecs>"]
["/Section",null,null,{"$f":"\"<\" & A508 & \">\"","v":"</Section>"},"Yes","</Section>"]
["/Section_List",null,null,{"$f":"\"<\" & A509 & \">\"","v":"</Section_List>"},"Yes","</Section_List>"]
["/Component",null,{"$f":"C339","v":"Yes"},{"$f":"IF(C510=\"Yes\",(\"<\"&A510&\">\"),(\"<\"&A510&\"-->\"))","v":"</Component>"},"Yes","</Component>"]
["Component","WING","Yes",{"$f":"IF(C511=\"Yes\",(\"<\"&A511&\">\"),(\"<!--\"&A511&\">\"))","v":"<Component>"},{"$f":"IF(D511=F511,\"Yes\",\"No\")","v":"Yes"},"<Component>"]
["Type","Mswing",null,{"$f":"\"<\" & A512 & \">\" & TEXT(B512,0) & \"</\" & A512 & \">\"","v":"<Type>Mswing</Type>"},"Yes","<Type>Mswing</Type>"]
["General_Parms",null,null,{"$f":"\"<\" & A513 & \">\"","v":"<General_Parms>"},"Yes","<General_Parms>"]
["Name","Wing",null,{"$f":"\"<\" & A514 & \">\" & TEXT(B514,0) & \"</\" & A514 & \">\"","v":"<Name>Wing</Name>"},"Yes","<Name>Wing</Name>"]
["ColorR",255,null,{"$f":"\"<\" & A515 & \">\" & TEXT(B515,\"0.000000\") & \"</\" & A515 & \">\"","v":"<ColorR>255.000000</ColorR>"},"Yes","<ColorR>255.000000</ColorR>"]
["ColorG",0,null,{"$f":"\"<\" & A516 & \">\" & TEXT(B516,\"0.000000\") & \"</\" & A516 & \">\"","v":"<ColorG>0.000000</ColorG>"},"Yes","<ColorG>0.000000</ColorG>"]
["ColorB",0,null,{"$f":"\"<\" & A517 & \">\" & TEXT(B517,\"0.000000\") & \"</\" & A517 & \">\"","v":"<ColorB>0.000000</ColorB>"},"Yes","<ColorB>0.000000</ColorB>"]
["Symmetry",2,null,{"$f":"\"<\" & A518 & \">\" & TEXT(B518,0) & \"</\" & A518 & \">\"","v":"<Symmetry>2</Symmetry>"},"Yes","<Symmetry>2</Symmetry>"]
["RelXFormFlag","No",null,{"$f":"\"<\" & A519 & \">\" &IF(B519=\"Yes\",1,0) &\"</\" &A519&\">\"","v":"<RelXFormFlag>0</RelXFormFlag>"},"Yes","<RelXFormFlag>0</RelXFormFlag>"]
["MaterialID",1,null,{"$f":"\"<\" & A520 & \">\" & TEXT(B520,0) & \"</\" & A520 & \">\"","v":"<MaterialID>1</MaterialID>"},"Yes","<MaterialID>1</MaterialID>"]
["OutputFlag","Yes",null,{"$f":"\"<\" & A521 & \">\" &IF(B521=\"Yes\",1,0) &\"</\" &A521&\">\"","v":"<OutputFlag>1</OutputFlag>"},"Yes","<OutputFlag>1</OutputFlag>"]
["OutputNameID",0,null,{"$f":"\"<\" & A522 & \">\" & TEXT(B522,0) & \"</\" & A522 & \">\"","v":"<OutputNameID>0</OutputNameID>"},"Yes","<OutputNameID>0</OutputNameID>"]
["DisplayChildrenFlag","Yes",null,{"$f":"\"<\" & A523 & \">\" &IF(B523=\"Yes\",1,0) &\"</\" &A523&\">\"","v":"<DisplayChildrenFlag>1</DisplayChildrenFlag>"},"Yes","<DisplayChildrenFlag>1</DisplayChildrenFlag>"]
["NumPnts",21,null,{"$f":"\"<\" & A524 & \">\" & TEXT(B524,0) & \"</\" & A524 & \">\"","v":"<NumPnts>21</NumPnts>"},"Yes","<NumPnts>21</NumPnts>"]
["NumXsecs",11,null,{"$f":"\"<\" & A525 & \">\" & TEXT(B525,0) & \"</\" & A525 & \">\"","v":"<NumXsecs>11</NumXsecs>"},"Yes","<NumXsecs>11</NumXsecs>"]
["MassPrior",0,null,{"$f":"\"<\" & A526 & \">\" & TEXT(B526,0) & \"</\" & A526 & \">\"","v":"<MassPrior>0</MassPrior>"},"Yes","<MassPrior>0</MassPrior>"]
["ShellFlag","No",null,{"$f":"\"<\" & A527 & \">\" &IF(B527=\"Yes\",1,0) &\"</\" &A527&\">\"","v":"<ShellFlag>0</ShellFlag>"},"Yes","<ShellFlag>0</ShellFlag>"]
["Tran_X",{"$f":"pos_W.x","v":18.367650000000001},null,{"$f":"\"<\" & A528 & \">\" & TEXT(B528,\"0.000000\") & \"</\" & A528 & \">\"","v":"<Tran_X>18.367650</Tran_X>"},"No","<Tran_X>11.277000</Tran_X>"]
["Tran_Y",{"$f":"pos_W.y","v":0},null,"<Tran_Y>0.000000</Tran_Y>","Yes","<Tran_Y>0.000000</Tran_Y>"]
["Tran_Z",{"$f":"pos_W.z","v":-1.4577500000000001},null,"<Tran_Z>-1.457750</Tran_Z>","No","<Tran_Z>-0.990000</Tran_Z>"]
["TranRel_X",0,null,"<TranRel_X>0.000000</TranRel_X>","Yes","<TranRel_X>0.000000</TranRel_X>"]
["TranRel_Y",0,null,"<TranRel_Y>0.000000</TranRel_Y>","Yes","<TranRel_Y>0.000000</TranRel_Y>"]
["TranRel_Z",0,null,"<TranRel_Z>0.000000</TranRel_Z>","Yes","<TranRel_Z>0.000000</TranRel_Z>"]
["Rot_X",0,null,"<Rot_X>0.000000</Rot_X>","Yes","<Rot_X>0.000000</Rot_X>"]
["Rot_Y",0,null,"<Rot_Y>0.000000</Rot_Y>","Yes","<Rot_Y>0.000000</Rot_Y>"]
["Rot_Z",0,null,"<Rot_Z>0.000000</Rot_Z>","Yes","<Rot_Z>0.000000</Rot_Z>"]
["RotRel_X",0,null,"<RotRel_X>0.000000</RotRel_X>","Yes","<RotRel_X>0.000000</RotRel_X>"]
["RotRel_Y",0,null,"<RotRel_Y>0.000000</RotRel_Y>","Yes","<RotRel_Y>0.000000</RotRel_Y>"]
["RotRel_Z",0,null,"<RotRel_Z>0.000000</RotRel_Z>","Yes","<RotRel_Z>0.000000</RotRel_Z>"]
["Origin",0,null,"<Origin>0.000000</Origin>","Yes","<Origin>0.000000</Origin>"]
["Density",1,null,"<Density>1.000000</Density>","Yes","<Density>1.000000</Density>"]
["ShellMassArea",1,null,"<ShellMassArea>1.000000</ShellMassArea>","Yes","<ShellMassArea>1.000000</ShellMassArea>"]
["RefFlag",0,null,{"$f":"\"<\" & A543 & \">\" &IF(B543=\"Yes\",1,0) &\"</\" &A543&\">\"","v":"<RefFlag>0</RefFlag>"},"Yes","<RefFlag>0</RefFlag>"]
["RefArea",100,null,{"$f":"\"<\" & A544 & \">\" & TEXT(B544,\"0.000000\") & \"</\" & A544 & \">\"","v":"<RefArea>100.000000</RefArea>"},"Yes","<RefArea>100.000000</RefArea>"]
["RefSpan",10,null,{"$f":"\"<\" & A545 & \">\" & TEXT(B545,\"0.000000\") & \"</\" & A545 & \">\"","v":"<RefSpan>10.000000</RefSpan>"},"Yes","<RefSpan>10.000000</RefSpan>"]
["RefCbar",1,null,{"$f":"\"<\" & A546 & \">\" & TEXT(B546,\"0.000000\") & \"</\" & A546 & \">\"","v":"<RefCbar>1.000000</RefCbar>"},"Yes","<RefCbar>1.000000</RefCbar>"]
["AutoRefAreaFlag","Yes",null,{"$f":"\"<\" & A547 & \">\" &IF(B547=\"Yes\",1,0) &\"</\" &A547&\">\"","v":"<AutoRefAreaFlag>1</AutoRefAreaFlag>"},"Yes","<AutoRefAreaFlag>1</AutoRefAreaFlag>"]
["AutoRefSpanFlag","Yes",null,{"$f":"\"<\" & A548 & \">\" &IF(B548=\"Yes\",1,0) &\"</\" &A548&\">\"","v":"<AutoRefSpanFlag>1</AutoRefSpanFlag>"},"Yes","<AutoRefSpanFlag>1</AutoRefSpanFlag>"]
["AutoRefCbarFlag","Yes",null,{"$f":"\"<\" & A549 & \">\" &IF(B549=\"Yes\",1,0) &\"</\" &A549&\">\"","v":"<AutoRefCbarFlag>1</AutoRefCbarFlag>"},"Yes","<AutoRefCbarFlag>1</AutoRefCbarFlag>"]
["AeroCenter_X",0,null,{"$f":"\"<\" & A550 & \">\" & TEXT(B550,\"0.000000\") & \"</\" & A550 & \">\"","v":"<AeroCenter_X>0.000000</AeroCenter_X>"},"Yes","<AeroCenter_X>0.000000</AeroCenter_X>"]
["AeroCenter_Y",0,null,{"$f":"\"<\" & A551 & \">\" & TEXT(B551,\"0.000000\") & \"</\" & A551 & \">\"","v":"<AeroCenter_Y>0.000000</AeroCenter_Y>"},"Yes","<AeroCenter_Y>0.000000</AeroCenter_Y>"]
["AeroCenter_Z",0,null,{"$f":"\"<\" & A552 & \">\" & TEXT(B552,\"0.000000\") & \"</\" & A552 & \">\"","v":"<AeroCenter_Z>0.000000</AeroCenter_Z>"},"Yes","<AeroCenter_Z>0.000000</AeroCenter_Z>"]
["AutoAeroCenterFlag","Yes",null,{"$f":"\"<\" & A553 & \">\" &IF(B553=\"Yes\",1,0) &\"</\" &A553&\">\"","v":"<AutoAeroCenterFlag>1</AutoAeroCenterFlag>"},"Yes","<AutoAeroCenterFlag>1</AutoAeroCenterFlag>"]
["WakeActiveFlag","No",null,{"$f":"\"<\" & A554 & \">\" &IF(B554=\"Yes\",1,0) &\"</\" &A554&\">\"","v":"<WakeActiveFlag>0</WakeActiveFlag>"},"Yes","<WakeActiveFlag>0</WakeActiveFlag>"]
["PosAttachFlag","No",null,{"$f":"\"<\" & A555 & \">\" &IF(B555=\"Yes\",1,0) &\"</\" &A555&\">\"","v":"<PosAttachFlag>0</PosAttachFlag>"},"Yes","<PosAttachFlag>0</PosAttachFlag>"]
["U_Attach",0,null,{"$f":"\"<\" & A556 & \">\" & TEXT(B556,\"0.000000\") & \"</\" & A556 & \">\"","v":"<U_Attach>0.000000</U_Attach>"},"Yes","<U_Attach>0.000000</U_Attach>"]
["V_Attach",0,null,{"$f":"\"<\" & A557 & \">\" & TEXT(B557,\"0.000000\") & \"</\" & A557 & \">\"","v":"<V_Attach>0.000000</V_Attach>"},"Yes","<V_Attach>0.000000</V_Attach>"]
["PtrID",148262920,null,"<PtrID>148262920</PtrID>","Yes","<PtrID>148262920</PtrID>"]
["Parent_PtrID",0,null,{"$f":"\"<\" & A559 & \">\" & TEXT(B559,0) & \"</\" & A559 & \">\"","v":"<Parent_PtrID>0</Parent_PtrID>"},"Yes","<Parent_PtrID>0</Parent_PtrID>"]
["/General_Parms",null,null,{"$f":"\"<\" & A560 & \">\"","v":"</General_Parms>"},"Yes","</General_Parms>"]
["Mswing_Parms",null,null,{"$f":"\"<\" & A561 & \">\"","v":"<Mswing_Parms>"},"Yes","<Mswing_Parms>"]
["Total_Area",{"$f":"S_W","v":361.6},null,{"$f":"\"<\" & A562 & \">\" & TEXT(B562,\"0.000000\") & \"</\" & A562 & \">\"","v":"<Total_Area>361.600000</Total_Area>"},"No","<Total_Area>122.600000</Total_Area>"]
["Total_Span",{"$f":"b_W","v":60.28333102939817},null,{"$f":"\"<\" & A563 & \">\" & TEXT(B563,\"0.000000\") & \"</\" & A563 & \">\"","v":"<Total_Span>60.283331</Total_Span>"},"No","<Total_Span>33.940383</Total_Span>"]
["Total_Proj_Span",{"$f":"2*(B644*COS(B651*PI()/180) + B665*COS(B672*PI()/180))","v":60.044673265031861},null,{"$f":"\"<\" & A564 & \">\" & TEXT(B564,\"0.000000\") & \"</\" & A564 & \">\"","v":"<Total_Proj_Span>60.044673</Total_Proj_Span>"},"No","<Total_Proj_Span>33.806015</Total_Proj_Span>"]
["Avg_Chord",{"$f":"((B643/B644) + (B664/B665))/2","v":6.8480394337603547},null,{"$f":"\"<\" & A565 & \">\" & TEXT(B565,\"0.000000\") & \"</\" & A565 & \">\"","v":"<Avg_Chord>6.848039</Avg_Chord>"},"No","<Avg_Chord>4.069632</Avg_Chord>"]
["Sweep_Off",0,null,{"$f":"\"<\" & A566 & \">\" & TEXT(B566,\"0.000000\") & \"</\" & A566 & \">\"","v":"<Sweep_Off>0.000000</Sweep_Off>"},"Yes","<Sweep_Off>0.000000</Sweep_Off>"]
["Deg_Per_Seg",9,null,{"$f":"\"<\" & A567 & \">\" & TEXT(B567,0) & \"</\" & A567 & \">\"","v":"<Deg_Per_Seg>9</Deg_Per_Seg>"},"Yes","<Deg_Per_Seg>9</Deg_Per_Seg>"]
["Max_Num_Seg",9,null,{"$f":"\"<\" & A568 & \">\" & TEXT(B568,0) & \"</\" & A568 & \">\"","v":"<Max_Num_Seg>9</Max_Num_Seg>"},"Yes","<Max_Num_Seg>9</Max_Num_Seg>"]
["Rel_Dihedral_Flag",0,null,{"$f":"\"<\" & A569 & \">\" & TEXT(B569,0) & \"</\" & A569 & \">\"","v":"<Rel_Dihedral_Flag>0</Rel_Dihedral_Flag>"},{"$f":"IF(D569=F569,\"Yes\",\"No\")","v":"Yes"},"<Rel_Dihedral_Flag>0</Rel_Dihedral_Flag>"]
["Rel_Twist_Flag",0,null,{"$f":"\"<\" & A570 & \">\" & TEXT(B570,0) & \"</\" & A570 & \">\"","v":"<Rel_Twist_Flag>0</Rel_Twist_Flag>"},"Yes","<Rel_Twist_Flag>0</Rel_Twist_Flag>"]
["Round_End_Cap_Flag","Yes",null,{"$f":"\"<\" & A571 & \">\" &IF(B571=\"Yes\",1,0) &\"</\" &A571&\">\"","v":"<Round_End_Cap_Flag>1</Round_End_Cap_Flag>"},"Yes","<Round_End_Cap_Flag>1</Round_End_Cap_Flag>"]
["/Mswing_Parms",null,null,{"$f":"\"<\" & A572 & \">\"","v":"</Mswing_Parms>"},"Yes","</Mswing_Parms>"]
["Airfoil_List",null,null,{"$f":"\"<\" & A573 & \">\"","v":"<Airfoil_List>"},"Yes","<Airfoil_List>"]
["Airfoil","Airfoil0",null,{"$f":"\"<\" & A574 & \">\"","v":"<Airfoil>"},"Yes","<Airfoil>"]
["Type",1,null,{"$f":"\"<\" & A575 & \">\" & TEXT(B575,0) & \"</\" & A575 & \">\"","v":"<Type>1</Type>"},"Yes","<Type>1</Type>"]
["Inverted_Flag","No",null,{"$f":"\"<\" & A576 & \">\" &IF(B576=\"Yes\",1,0) &\"</\" &A576&\">\"","v":"<Inverted_Flag>0</Inverted_Flag>"},"Yes","<Inverted_Flag>0</Inverted_Flag>"]
["Camber",0.02,null,{"$f":"\"<\" & A577 & \">\" & TEXT(B577,\"0.000000\") & \"</\" & A577 & \">\"","v":"<Camber>0.020000</Camber>"},"Yes","<Camber>0.020000</Camber>"]
["Camber_Loc",0.3,null,"<Camber_Loc>0.300000</Camber_Loc>","Yes","<Camber_Loc>0.300000</Camber_Loc>"]
["Thickness",{"$f":"(15/11)*(t\\c)","v":0.20454545454545453},null,"<Thickness>0.204545</Thickness>","No","<Thickness>0.177273</Thickness>"]
["Thickness_Loc",0.3,null,"<Thickness_Loc>0.300000</Thickness_Loc>","Yes","<Thickness_Loc>0.300000</Thickness_Loc>"]
["Radius_Le",1.5866999999999999E-2,null,"<Radius_Le>0.015867</Radius_Le>","Yes","<Radius_Le>0.015867</Radius_Le>"]
["Radius_Te",0,null,"<Radius_Te>0.000000</Radius_Te>","Yes","<Radius_Te>0.000000</Radius_Te>"]
["Six_Series",63,null,{"$f":"\"<\" & A583 & \">\" & TEXT(B583,0) & \"</\" & A583 & \">\"","v":"<Six_Series>63</Six_Series>"},"Yes","<Six_Series>63</Six_Series>"]
["Ideal_Cl",0,null,{"$f":"\"<\" & A584 & \">\" & TEXT(B584,\"0.000000\") & \"</\" & A584 & \">\"","v":"<Ideal_Cl>0.000000</Ideal_Cl>"},"Yes","<Ideal_Cl>0.000000</Ideal_Cl>"]
["A",0,null,{"$f":"\"<\" & A585 & \">\" & TEXT(B585,\"0.000000\") & \"</\" & A585 & \">\"","v":"<A>0.000000</A>"},"Yes","<A>0.000000</A>"]
["Slat_Flag","No",null,{"$f":"\"<\" & A586 & \">\" &IF(B586=\"Yes\",1,0) &\"</\" &A586&\">\"","v":"<Slat_Flag>0</Slat_Flag>"},"Yes","<Slat_Flag>0</Slat_Flag>"]
["Slat_Shear_Flag","No",null,{"$f":"\"<\" & A587 & \">\" &IF(B587=\"Yes\",1,0) &\"</\" &A587&\">\"","v":"<Slat_Shear_Flag>0</Slat_Shear_Flag>"},"Yes","<Slat_Shear_Flag>0</Slat_Shear_Flag>"]
["Slat_Chord",0.25,null,{"$f":"\"<\" & A588 & \">\" & TEXT(B588,\"0.000000\") & \"</\" & A588 & \">\"","v":"<Slat_Chord>0.250000</Slat_Chord>"},"Yes","<Slat_Chord>0.250000</Slat_Chord>"]
["Slat_Angle",10,null,{"$f":"\"<\" & A589 & \">\" & TEXT(B589,\"0.000000\") & \"</\" & A589 & \">\"","v":"<Slat_Angle>10.000000</Slat_Angle>"},"Yes","<Slat_Angle>10.000000</Slat_Angle>"]
["Flap_Flag","Yes",null,{"$f":"\"<\" & A590 & \">\" &IF(B590=\"Yes\",1,0) &\"</\" &A590&\">\"","v":"<Flap_Flag>1</Flap_Flag>"},"Yes","<Flap_Flag>1</Flap_Flag>"]
["Flap_Shear_Flag","No",null,{"$f":"\"<\" & A591 & \">\" &IF(B591=\"Yes\",1,0) &\"</\" &A591&\">\"","v":"<Flap_Shear_Flag>0</Flap_Shear_Flag>"},"Yes","<Flap_Shear_Flag>0</Flap_Shear_Flag>"]
["Flap_Chord",0.31,null,{"$f":"\"<\" & A592 & \">\" & TEXT(B592,\"0.000000\") & \"</\" & A592 & \">\"","v":"<Flap_Chord>0.310000</Flap_Chord>"},"Yes","<Flap_Chord>0.310000</Flap_Chord>"]
["Flap_Angle",0,null,{"$f":"\"<\" & A593 & \">\" & TEXT(B593,\"0.000000\") & \"</\" & A593 & \">\"","v":"<Flap_Angle>0.000000</Flap_Angle>"},"Yes","<Flap_Angle>0.000000</Flap_Angle>"]
["/Airfoil",null,null,{"$f":"\"<\" & A594 & \">\"","v":"</Airfoil>"},"Yes","</Airfoil>"]
["Airfoil","Airfoil1",null,{"$f":"\"<\" & A595 & \">\"","v":"<Airfoil>"},"Yes","<Airfoil>"]
["Type",1,null,{"$f":"\"<\" & A596 & \">\" & TEXT(B596,0) & \"</\" & A596 & \">\"","v":"<Type>1</Type>"},"Yes","<Type>1</Type>"]
["Inverted_Flag","No",null,{"$f":"\"<\" & A597 & \">\" &IF(B597=\"Yes\",1,0) &\"</\" &A597&\">\"","v":"<Inverted_Flag>0</Inverted_Flag>"},"Yes","<Inverted_Flag>0</Inverted_Flag>"]
["Camber",0.02,null,{"$f":"\"<\" & A598 & \">\" & TEXT(B598,\"0.000000\") & \"</\" & A598 & \">\"","v":"<Camber>0.020000</Camber>"},"Yes","<Camber>0.020000</Camber>"]
["Camber_Loc",0.3,null,"<Camber_Loc>0.300000</Camber_Loc>","Yes","<Camber_Loc>0.300000</Camber_Loc>"]
["Thickness",{"$f":"t\\c","v":0.15},null,"<Thickness>0.150000</Thickness>","No","<Thickness>0.130000</Thickness>"]
["Thickness_Loc",0.3,null,"<Thickness_Loc>0.300000</Thickness_Loc>","Yes","<Thickness_Loc>0.300000</Thickness_Loc>"]
["Radius_Le",1.5866999999999999E-2,null,"<Radius_Le>0.015867</Radius_Le>","Yes","<Radius_Le>0.015867</Radius_Le>"]
["Radius_Te",0,null,"<Radius_Te>0.000000</Radius_Te>","Yes","<Radius_Te>0.000000</Radius_Te>"]
["Six_Series",63,null,{"$f":"\"<\" & A604 & \">\" & TEXT(B604,0) & \"</\" & A604 & \">\"","v":"<Six_Series>63</Six_Series>"},"Yes","<Six_Series>63</Six_Series>"]
["Ideal_Cl",0,null,{"$f":"\"<\" & A605 & \">\" & TEXT(B605,\"0.000000\") & \"</\" & A605 & \">\"","v":"<Ideal_Cl>0.000000</Ideal_Cl>"},"Yes","<Ideal_Cl>0.000000</Ideal_Cl>"]
["A",0,null,{"$f":"\"<\" & A606 & \">\" & TEXT(B606,\"0.000000\") & \"</\" & A606 & \">\"","v":"<A>0.000000</A>"},"Yes","<A>0.000000</A>"]
["Slat_Flag","No",null,{"$f":"\"<\" & A607 & \">\" &IF(B607=\"Yes\",1,0) &\"</\" &A607&\">\"","v":"<Slat_Flag>0</Slat_Flag>"},"Yes","<Slat_Flag>0</Slat_Flag>"]
["Slat_Shear_Flag","No",null,{"$f":"\"<\" & A608 & \">\" &IF(B608=\"Yes\",1,0) &\"</\" &A608&\">\"","v":"<Slat_Shear_Flag>0</Slat_Shear_Flag>"},"Yes","<Slat_Shear_Flag>0</Slat_Shear_Flag>"]
["Slat_Chord",0.25,null,{"$f":"\"<\" & A609 & \">\" & TEXT(B609,\"0.000000\") & \"</\" & A609 & \">\"","v":"<Slat_Chord>0.250000</Slat_Chord>"},"Yes","<Slat_Chord>0.250000</Slat_Chord>"]
["Slat_Angle",10,null,{"$f":"\"<\" & A610 & \">\" & TEXT(B610,\"0.000000\") & \"</\" & A610 & \">\"","v":"<Slat_Angle>10.000000</Slat_Angle>"},"Yes","<Slat_Angle>10.000000</Slat_Angle>"]
["Flap_Flag","Yes",null,{"$f":"\"<\" & A611 & \">\" &IF(B611=\"Yes\",1,0) &\"</\" &A611&\">\"","v":"<Flap_Flag>1</Flap_Flag>"},"Yes","<Flap_Flag>1</Flap_Flag>"]
["Flap_Shear_Flag","No",null,{"$f":"\"<\" & A612 & \">\" &IF(B612=\"Yes\",1,0) &\"</\" &A612&\">\"","v":"<Flap_Shear_Flag>0</Flap_Shear_Flag>"},"Yes","<Flap_Shear_Flag>0</Flap_Shear_Flag>"]
["Flap_Chord",0.31,null,{"$f":"\"<\" & A613 & \">\" & TEXT(B613,\"0.000000\") & \"</\" & A613 & \">\"","v":"<Flap_Chord>0.310000</Flap_Chord>"},"Yes","<Flap_Chord>0.310000</Flap_Chord>"]
["Flap_Angle",0,null,{"$f":"\"<\" & A614 & \">\" & TEXT(B614,\"0.000000\") & \"</\" & A614 & \">\"","v":"<Flap_Angle>0.000000</Flap_Angle>"},"Yes","<Flap_Angle>0.000000</Flap_Angle>"]
["/Airfoil",null,null,{"$f":"\"<\" & A615 & \">\"","v":"</Airfoil>"},"Yes","</Airfoil>"]
["Airfoil","Airfoil2",null,{"$f":"\"<\" & A616 & \">\"","v":"<Airfoil>"},"Yes","<Airfoil>"]
["Type",1,null,{"$f":"\"<\" & A617 & \">\" & TEXT(B617,0) & \"</\" & A617 & \">\"","v":"<Type>1</Type>"},"Yes","<Type>1</Type>"]
["Inverted_Flag","No",null,{"$f":"\"<\" & A618 & \">\" &IF(B618=\"Yes\",1,0) &\"</\" &A618&\">\"","v":"<Inverted_Flag>0</Inverted_Flag>"},"Yes","<Inverted_Flag>0</Inverted_Flag>"]
["Camber",0.02,null,{"$f":"\"<\" & A619 & \">\" & TEXT(B619,\"0.000000\") & \"</\" & A619 & \">\"","v":"<Camber>0.020000</Camber>"},"Yes","<Camber>0.020000</Camber>"]
["Camber_Loc",0.3,null,"<Camber_Loc>0.300000</Camber_Loc>","Yes","<Camber_Loc>0.300000</Camber_Loc>"]
["Thickness",{"$f":"t\\c","v":0.15},null,"<Thickness>0.150000</Thickness>","No","<Thickness>0.130000</Thickness>"]
["Thickness_Loc",0.3,null,"<Thickness_Loc>0.300000</Thickness_Loc>","Yes","<Thickness_Loc>0.300000</Thickness_Loc>"]
["Radius_Le",1.5866999999999999E-2,null,"<Radius_Le>0.015867</Radius_Le>","Yes","<Radius_Le>0.015867</Radius_Le>"]
["Radius_Te",0,null,"<Radius_Te>0.000000</Radius_Te>","Yes","<Radius_Te>0.000000</Radius_Te>"]
["Six_Series",63,null,{"$f":"\"<\" & A625 & \">\" & TEXT(B625,0) & \"</\" & A625 & \">\"","v":"<Six_Series>63</Six_Series>"},"Yes","<Six_Series>63</Six_Series>"]
["Ideal_Cl",0,null,{"$f":"\"<\" & A626 & \">\" & TEXT(B626,\"0.000000\") & \"</\" & A626 & \">\"","v":"<Ideal_Cl>0.000000</Ideal_Cl>"},"Yes","<Ideal_Cl>0.000000</Ideal_Cl>"]
["A",0,null,{"$f":"\"<\" & A627 & \">\" & TEXT(B627,\"0.000000\") & \"</\" & A627 & \">\"","v":"<A>0.000000</A>"},"Yes","<A>0.000000</A>"]
["Slat_Flag","No",null,{"$f":"\"<\" & A628 & \">\" &IF(B628=\"Yes\",1,0) &\"</\" &A628&\">\"","v":"<Slat_Flag>0</Slat_Flag>"},"Yes","<Slat_Flag>0</Slat_Flag>"]
["Slat_Shear_Flag","No",null,{"$f":"\"<\" & A629 & \">\" &IF(B629=\"Yes\",1,0) &\"</\" &A629&\">\"","v":"<Slat_Shear_Flag>0</Slat_Shear_Flag>"},"Yes","<Slat_Shear_Flag>0</Slat_Shear_Flag>"]
["Slat_Chord",0.25,null,{"$f":"\"<\" & A630 & \">\" & TEXT(B630,\"0.000000\") & \"</\" & A630 & \">\"","v":"<Slat_Chord>0.250000</Slat_Chord>"},"Yes","<Slat_Chord>0.250000</Slat_Chord>"]
["Slat_Angle",10,null,{"$f":"\"<\" & A631 & \">\" & TEXT(B631,\"0.000000\") & \"</\" & A631 & \">\"","v":"<Slat_Angle>10.000000</Slat_Angle>"},"Yes","<Slat_Angle>10.000000</Slat_Angle>"]
["Flap_Flag","Yes",null,{"$f":"\"<\" & A632 & \">\" &IF(B632=\"Yes\",1,0) &\"</\" &A632&\">\"","v":"<Flap_Flag>1</Flap_Flag>"},"Yes","<Flap_Flag>1</Flap_Flag>"]
["Flap_Shear_Flag","No",null,{"$f":"\"<\" & A633 & \">\" &IF(B633=\"Yes\",1,0) &\"</\" &A633&\">\"","v":"<Flap_Shear_Flag>0</Flap_Shear_Flag>"},{"$f":"IF(D633=F633,\"Yes\",\"No\")","v":"Yes"},"<Flap_Shear_Flag>0</Flap_Shear_Flag>"]
["Flap_Chord",0.31,null,{"$f":"\"<\" & A634 & \">\" & TEXT(B634,\"0.000000\") & \"</\" & A634 & \">\"","v":"<Flap_Chord>0.310000</Flap_Chord>"},"Yes","<Flap_Chord>0.310000</Flap_Chord>"]
["Flap_Angle",0,null,{"$f":"\"<\" & A635 & \">\" & TEXT(B635,\"0.000000\") & \"</\" & A635 & \">\"","v":"<Flap_Angle>0.000000</Flap_Angle>"},"Yes","<Flap_Angle>0.000000</Flap_Angle>"]
["/Airfoil",null,null,{"$f":"\"<\" & A636 & \">\"","v":"</Airfoil>"},"Yes","</Airfoil>"]
["/Airfoil_List",null,null,{"$f":"\"<\" & A637 & \">\"","v":"</Airfoil_List>"},"Yes","</Airfoil_List>"]
["Section_List",null,null,{"$f":"\"<\" & A638 & \">\"","v":"<Section_List>"},"Yes","<Section_List>"]
["Section","Section0",null,{"$f":"\"<\" & A639 & \">\"","v":"<Section>"},"Yes","<Section>"]
["Driver",0,null,{"$f":"\"<\" & A640 & \">\" & TEXT(B640,0) & \"</\" & A640 & \">\"","v":"<Driver>0</Driver>"},"Yes","<Driver>0</Driver>"]
["AR",{"$f":"(B644^2)/B643","v":1.0474594274242419},null,{"$f":"\"<\" & A641 & \">\" & TEXT(B641,\"0.000000\") & \"</\" & A641 & \">\"","v":"<AR>1.047459</AR>"},"No","<AR>1.016896</AR>"]
["TR",{"$f":"B645/B646","v":0.52153696222360646},null,"<TR>0.521537</TR>","No","<TR>0.584502</TR>"]
["Area",{"$f":"0.5*(c_r.W+c_W.k)*b_W.i","v":88.817232977483158},null,"<Area>88.817233</Area>","No","<Area>28.999922</Area>"]
["Span",{"$f":"b_W.i","v":9.6453329647037069},null,"<Span>9.645333</Span>","No","<Span>5.430461</Span>"]
["TC",{"$f":"c_W.k","v":6.3126628695405635},null,"<TC>6.312663</TC>","No","<TC>3.939881</TC>"]
["RC",{"$f":"c_r.W","v":12.103960652426471},null,"<RC>12.103961</RC>","No","<RC>6.740582</RC>"]
["Sweep",{"$f":"phi_100.W.i","v":0},null,"<Sweep>0.000000</Sweep>","Yes","<Sweep>0.000000</Sweep>"]
["SweepLoc",1,null,"<SweepLoc>1.000000</SweepLoc>","Yes","<SweepLoc>1.000000</SweepLoc>"]
["Twist",0,null,"<Twist>0.000000</Twist>","Yes","<Twist>0.000000</Twist>"]
["TwistLoc",0,null,"<TwistLoc>0.000000</TwistLoc>","Yes","<TwistLoc>0.000000</TwistLoc>"]
["Dihedral",{"$f":"ggam_W.o","v":5.0999999999999996},null,"<Dihedral>5.100000</Dihedral>","Yes","<Dihedral>5.100000</Dihedral>"]
["Dihed_Crv1",0,null,"<Dihed_Crv1>0.000000</Dihed_Crv1>","Yes","<Dihed_Crv1>0.000000</Dihed_Crv1>"]
["Dihed_Crv2",0,null,"<Dihed_Crv2>0.000000</Dihed_Crv2>","Yes","<Dihed_Crv2>0.000000</Dihed_Crv2>"]
["Dihed_Crv1_Str",0.75,null,"<Dihed_Crv1_Str>0.750000</Dihed_Crv1_Str>","Yes","<Dihed_Crv1_Str>0.750000</Dihed_Crv1_Str>"]
["Dihed_Crv2_Str",0.75,null,"<Dihed_Crv2_Str>0.750000</Dihed_Crv2_Str>","Yes","<Dihed_Crv2_Str>0.750000</Dihed_Crv2_Str>"]
["DihedRotFlag","No",null,{"$f":"\"<\" & A656 & \">\" &IF(B656=\"Yes\",1,0) &\"</\" &A656&\">\"","v":"<DihedRotFlag>0</DihedRotFlag>"},"Yes","<DihedRotFlag>0</DihedRotFlag>"]
["SmoothBlendFlag","No",null,{"$f":"\"<\" & A657 & \">\" &IF(B657=\"Yes\",1,0) &\"</\" &A657&\">\"","v":"<SmoothBlendFlag>0</SmoothBlendFlag>"},"Yes","<SmoothBlendFlag>0</SmoothBlendFlag>"]
["NumInterpXsecs",1,null,{"$f":"\"<\" & A658 & \">\" & TEXT(B658,0) & \"</\" & A658 & \">\"","v":"<NumInterpXsecs>1</NumInterpXsecs>"},"Yes","<NumInterpXsecs>1</NumInterpXsecs>"]
["/Section",null,null,{"$f":"\"<\" & A659 & \">\"","v":"</Section>"},"Yes","</Section>"]
["Section","Section1",null,{"$f":"\"<\" & A660 & \">\"","v":"<Section>"},"Yes","<Section>"]
["Driver",0,null,{"$f":"\"<\" & A661 & \">\" & TEXT(B661,0) & \"</\" & A661 & \">\"","v":"<Driver>0</Driver>"},"Yes","<Driver>0</Driver>"]
["AR",{"$f":"(B665^2)/B664","v":4.5671560184437823},null,{"$f":"\"<\" & A662 & \">\" & TEXT(B662,\"0.000000\") & \"</\" & A662 & \">\"","v":"<AR>4.567156</AR>"},"No","<AR>4.122757</AR>"]
["TR",{"$f":"B666/B667","v":0.42183012122863894},null,"<TR>0.421830</TR>","No","<TR>0.420871</TR>"]
["Area",{"$f":"0.5*(c_W.k+c_t.W)*(b_W/2 - b_W.i)","v":91.982767022516853},null,"<Area>91.982767</Area>","No","<Area>32.300078</Area>"]
["Span",{"$f":"IF(Type_W = \"Double-trapezoidal\", b_W/2 - b_W.i, b_W.i)","v":20.49633254999538},null,"<Span>20.496333</Span>","No","<Span>11.539730</Span>"]
["TC",{"$f":"c_t.W","v":2.6628713435338236},null,"<TC>2.662871</TC>","No","<TC>1.658183</TC>"]
["RC",{"$f":"c_W.k","v":6.3126628695405635},null,"<RC>6.312663</RC>","No","<RC>3.939881</RC>"]
["Sweep",{"$f":"phi_0.W.o","v":30.981652593950365},null,"<Sweep>30.981653</Sweep>","No","<Sweep>27.281924</Sweep>"]
["SweepLoc",0,null,"<SweepLoc>0.000000</SweepLoc>","Yes","<SweepLoc>0.000000</SweepLoc>"]
["Twist",0,null,"<Twist>0.000000</Twist>","Yes","<Twist>0.000000</Twist>"]
["TwistLoc",0,null,"<TwistLoc>0.000000</TwistLoc>","Yes","<TwistLoc>0.000000</TwistLoc>"]
["Dihedral",{"$f":"ggam_W.o","v":5.0999999999999996},null,"<Dihedral>5.100000</Dihedral>","Yes","<Dihedral>5.100000</Dihedral>"]
["Dihed_Crv1",0,null,"<Dihed_Crv1>0.000000</Dihed_Crv1>","Yes","<Dihed_Crv1>0.000000</Dihed_Crv1>"]
["Dihed_Crv2",0,null,"<Dihed_Crv2>0.000000</Dihed_Crv2>","Yes","<Dihed_Crv2>0.000000</Dihed_Crv2>"]
["Dihed_Crv1_Str",0.75,null,"<Dihed_Crv1_Str>0.750000</Dihed_Crv1_Str>","Yes","<Dihed_Crv1_Str>0.750000</Dihed_Crv1_Str>"]
["Dihed_Crv2_Str",0.75,null,"<Dihed_Crv2_Str>0.750000</Dihed_Crv2_Str>","Yes","<Dihed_Crv2_Str>0.750000</Dihed_Crv2_Str>"]
["DihedRotFlag","No",null,{"$f":"\"<\" & A677 & \">\" &IF(B677=\"Yes\",1,0) &\"</\" &A677&\">\"","v":"<DihedRotFlag>0</DihedRotFlag>"},"Yes","<DihedRotFlag>0</DihedRotFlag>"]
["SmoothBlendFlag","No",null,{"$f":"\"<\" & A678 & \">\" &IF(B678=\"Yes\",1,0) &\"</\" &A678&\">\"","v":"<SmoothBlendFlag>0</SmoothBlendFlag>"},"Yes","<SmoothBlendFlag>0</SmoothBlendFlag>"]
["NumInterpXsecs",1,null,{"$f":"\"<\" & A679 & \">\" & TEXT(B679,0) & \"</\" & A679 & \">\"","v":"<NumInterpXsecs>1</NumInterpXsecs>"},"Yes","<NumInterpXsecs>1</NumInterpXsecs>"]
["/Section",null,null,{"$f":"\"<\" & A680 & \">\"","v":"</Section>"},"Yes","</Section>"]
["/Section_List",null,null,{"$f":"\"<\" & A681 & \">\"","v":"</Section_List>"},"Yes","</Section_List>"]
["/Component",null,{"$f":"C511","v":"Yes"},{"$f":"IF(C682=\"Yes\",(\"<\"&A682&\">\"),(\"<\"&A682&\"-->\"))","v":"</Component>"},"Yes","</Component>"]
["Component","FUSELAGE","Yes",{"$f":"IF(C683=\"Yes\",(\"<\"&A683&\">\"),(\"<!--\"&A683&\">\"))","v":"<Component>"},"Yes","<Component>"]
["Type","Fuselage",null,{"$f":"\"<\" & A684 & \">\" & TEXT(B684,0) & \"</\" & A684 & \">\"","v":"<Type>Fuselage</Type>"},"Yes","<Type>Fuselage</Type>"]
["General_Parms",null,null,{"$f":"\"<\" & A685 & \">\"","v":"<General_Parms>"},"Yes","<General_Parms>"]
["Name","Fuselage",null,{"$f":"\"<\" & A686 & \">\" & TEXT(B686,0) & \"</\" & A686 & \">\"","v":"<Name>Fuselage</Name>"},"Yes","<Name>Fuselage</Name>"]
["ColorR",127,null,{"$f":"\"<\" & A687 & \">\" & TEXT(B687,\"0.000000\") & \"</\" & A687 & \">\"","v":"<ColorR>127.000000</ColorR>"},"Yes","<ColorR>127.000000</ColorR>"]
["ColorG",127,null,{"$f":"\"<\" & A688 & \">\" & TEXT(B688,\"0.000000\") & \"</\" & A688 & \">\"","v":"<ColorG>127.000000</ColorG>"},"Yes","<ColorG>127.000000</ColorG>"]
["ColorB",127,null,{"$f":"\"<\" & A689 & \">\" & TEXT(B689,\"0.000000\") & \"</\" & A689 & \">\"","v":"<ColorB>127.000000</ColorB>"},"Yes","<ColorB>127.000000</ColorB>"]
["Symmetry",0,null,{"$f":"\"<\" & A690 & \">\" & TEXT(B690,0) & \"</\" & A690 & \">\"","v":"<Symmetry>0</Symmetry>"},"Yes","<Symmetry>0</Symmetry>"]
["RelXFormFlag",0,null,"<RelXFormFlag>0</RelXFormFlag>","Yes","<RelXFormFlag>0</RelXFormFlag>"]
["MaterialID",3,null,"<MaterialID>3</MaterialID>","Yes","<MaterialID>3</MaterialID>"]
["OutputFlag",1,null,"<OutputFlag>1</OutputFlag>","Yes","<OutputFlag>1</OutputFlag>"]
["OutputNameID",0,null,"<OutputNameID>0</OutputNameID>","Yes","<OutputNameID>0</OutputNameID>"]
["DisplayChildrenFlag",1,null,"<DisplayChildrenFlag>1</DisplayChildrenFlag>","Yes","<DisplayChildrenFlag>1</DisplayChildrenFlag>"]
["NumPnts",44,null,"<NumPnts>44</NumPnts>","Yes","<NumPnts>44</NumPnts>"]
["NumXsecs",11,null,"<NumXsecs>11</NumXsecs>",{"$f":"IF(D697=F697,\"Yes\",\"No\")","v":"Yes"},"<NumXsecs>11</NumXsecs>"]
["MassPrior",0,null,"<MassPrior>0</MassPrior>","Yes","<MassPrior>0</MassPrior>"]
["ShellFlag",0,null,"<ShellFlag>0</ShellFlag>","Yes","<ShellFlag>0</ShellFlag>"]
["Tran_X",{"$f":"pos_F.x","v":0},null,{"$f":"\"<\" & A700 & \">\" & TEXT(B700,\"0.000000\") & \"</\" & A700 & \">\"","v":"<Tran_X>0.000000</Tran_X>"},"Yes","<Tran_X>0.000000</Tran_X>"]
["Tran_Y",{"$f":"pos_F.y","v":0},null,"<Tran_Y>0.000000</Tran_Y>","Yes","<Tran_Y>0.000000</Tran_Y>"]
["Tran_Z",{"$f":"pos_F.z","v":0},null,"<Tran_Z>0.000000</Tran_Z>","Yes","<Tran_Z>0.000000</Tran_Z>"]
["TranRel_X",0,null,"<TranRel_X>0.000000</TranRel_X>","Yes","<TranRel_X>0.000000</TranRel_X>"]
["TranRel_Y",0,null,"<TranRel_Y>0.000000</TranRel_Y>","Yes","<TranRel_Y>0.000000</TranRel_Y>"]
["TranRel_Z",0,null,"<TranRel_Z>0.000000</TranRel_Z>","Yes","<TranRel_Z>0.000000</TranRel_Z>"]
["Rot_X",0,null,"<Rot_X>0.000000</Rot_X>","Yes","<Rot_X>0.000000</Rot_X>"]
["Rot_Y",0,null,"<Rot_Y>0.000000</Rot_Y>","Yes","<Rot_Y>0.000000</Rot_Y>"]
["Rot_Z",0,null,"<Rot_Z>0.000000</Rot_Z>","Yes","<Rot_Z>0.000000</Rot_Z>"]
["RotRel_X",0,null,"<RotRel_X>0.000000</RotRel_X>","Yes","<RotRel_X>0.000000</RotRel_X>"]
["RotRel_Y",0,null,"<RotRel_Y>0.000000</RotRel_Y>","Yes","<RotRel_Y>0.000000</RotRel_Y>"]
["RotRel_Z",0,null,"<RotRel_Z>0.000000</RotRel_Z>","Yes","<RotRel_Z>0.000000</RotRel_Z>"]
["Origin",0,null,"<Origin>0.000000</Origin>","Yes","<Origin>0.000000</Origin>"]
["Density",1,null,"<Density>1.000000</Density>","Yes","<Density>1.000000</Density>"]
["ShellMassArea",1,null,"<ShellMassArea>1.000000</ShellMassArea>","Yes","<ShellMassArea>1.000000</ShellMassArea>"]
["RefFlag",0,null,{"$f":"\"<\" & A715 & \">\" & TEXT(B715,0) & \"</\" & A715 & \">\"","v":"<RefFlag>0</RefFlag>"},"Yes","<RefFlag>0</RefFlag>"]
["RefArea",100,null,{"$f":"\"<\" & A716 & \">\" & TEXT(B716,\"0.000000\") & \"</\" & A716 & \">\"","v":"<RefArea>100.000000</RefArea>"},"Yes","<RefArea>100.000000</RefArea>"]
["RefSpan",10,null,{"$f":"\"<\" & A717 & \">\" & TEXT(B717,\"0.000000\") & \"</\" & A717 & \">\"","v":"<RefSpan>10.000000</RefSpan>"},"Yes","<RefSpan>10.000000</RefSpan>"]
["RefCbar",1,null,{"$f":"\"<\" & A718 & \">\" & TEXT(B718,\"0.000000\") & \"</\" & A718 & \">\"","v":"<RefCbar>1.000000</RefCbar>"},"Yes","<RefCbar>1.000000</RefCbar>"]
["AutoRefAreaFlag",1,null,{"$f":"\"<\" & A719 & \">\" & TEXT(B719,0) & \"</\" & A719 & \">\"","v":"<AutoRefAreaFlag>1</AutoRefAreaFlag>"},"Yes","<AutoRefAreaFlag>1</AutoRefAreaFlag>"]
["AutoRefSpanFlag",1,null,{"$f":"\"<\" & A720 & \">\" & TEXT(B720,0) & \"</\" & A720 & \">\"","v":"<AutoRefSpanFlag>1</AutoRefSpanFlag>"},"Yes","<AutoRefSpanFlag>1</AutoRefSpanFlag>"]
["AutoRefCbarFlag",1,null,{"$f":"\"<\" & A721 & \">\" & TEXT(B721,0) & \"</\" & A721 & \">\"","v":"<AutoRefCbarFlag>1</AutoRefCbarFlag>"},"Yes","<AutoRefCbarFlag>1</AutoRefCbarFlag>"]
["AeroCenter_X",0,null,{"$f":"\"<\" & A722 & \">\" & TEXT(B722,\"0.000000\") & \"</\" & A722 & \">\"","v":"<AeroCenter_X>0.000000</AeroCenter_X>"},"Yes","<AeroCenter_X>0.000000</AeroCenter_X>"]
["AeroCenter_Y",0,null,{"$f":"\"<\" & A723 & \">\" & TEXT(B723,\"0.000000\") & \"</\" & A723 & \">\"","v":"<AeroCenter_Y>0.000000</AeroCenter_Y>"},"Yes","<AeroCenter_Y>0.000000</AeroCenter_Y>"]
["AeroCenter_Z",0,null,{"$f":"\"<\" & A724 & \">\" & TEXT(B724,\"0.000000\") & \"</\" & A724 & \">\"","v":"<AeroCenter_Z>0.000000</AeroCenter_Z>"},"Yes","<AeroCenter_Z>0.000000</AeroCenter_Z>"]
["AutoAeroCenterFlag",1,null,{"$f":"\"<\" & A725 & \">\" & TEXT(B725,0) & \"</\" & A725 & \">\"","v":"<AutoAeroCenterFlag>1</AutoAeroCenterFlag>"},"Yes","<AutoAeroCenterFlag>1</AutoAeroCenterFlag>"]
["WakeActiveFlag",0,null,{"$f":"\"<\" & A726 & \">\" & TEXT(B726,0) & \"</\" & A726 & \">\"","v":"<WakeActiveFlag>0</WakeActiveFlag>"},"Yes","<WakeActiveFlag>0</WakeActiveFlag>"]
["PosAttachFlag",0,null,{"$f":"\"<\" & A727 & \">\" & TEXT(B727,0) & \"</\" & A727 & \">\"","v":"<PosAttachFlag>0</PosAttachFlag>"},"Yes","<PosAttachFlag>0</PosAttachFlag>"]
["U_Attach",0,null,{"$f":"\"<\" & A728 & \">\" & TEXT(B728,\"0.000000\") & \"</\" & A728 & \">\"","v":"<U_Attach>0.000000</U_Attach>"},"Yes","<U_Attach>0.000000</U_Attach>"]
["V_Attach",0,null,{"$f":"\"<\" & A729 & \">\" & TEXT(B729,\"0.000000\") & \"</\" & A729 & \">\"","v":"<V_Attach>0.000000</V_Attach>"},"Yes","<V_Attach>0.000000</V_Attach>"]
["PtrID",138042360,null,{"$f":"\"<\" & A730 & \">\" & TEXT(B730,0) & \"</\" & A730 & \">\"","v":"<PtrID>138042360</PtrID>"},"Yes","<PtrID>138042360</PtrID>"]
["Parent_PtrID",0,null,{"$f":"\"<\" & A731 & \">\" & TEXT(B731,0) & \"</\" & A731 & \">\"","v":"<Parent_PtrID>0</Parent_PtrID>"},"Yes","<Parent_PtrID>0</Parent_PtrID>"]
["/General_Parms",null,null,{"$f":"\"<\" & A732 & \">\"","v":"</General_Parms>"},"Yes","</General_Parms>"]
["Fuse_Parms",null,null,{"$f":"\"<\" & A733 & \">\"","v":"<Fuse_Parms>"},"Yes","<Fuse_Parms>"]
["Fuse_Length",{"$f":"l_F","v":58.31},null,{"$f":"\"<\" & A734 & \">\" & TEXT(B734,\"0.000000\") & \"</\" & A734 & \">\"","v":"<Fuse_Length>58.310000</Fuse_Length>"},"No","<Fuse_Length>35.800000</Fuse_Length>"]
["Camber",0,null,"<Camber>0.000000</Camber>","Yes","<Camber>0.000000</Camber>"]
["Camber_Location",0.5,null,"<Camber_Location>0.500000</Camber_Location>","Yes","<Camber_Location>0.500000</Camber_Location>"]
["Aft_Offset",0,null,"<Aft_Offset>0.000000</Aft_Offset>","Yes","<Aft_Offset>0.000000</Aft_Offset>"]
["Nose_Angle",0,null,"<Nose_Angle>0.000000</Nose_Angle>","Yes","<Nose_Angle>0.000000</Nose_Angle>"]
["Nose_Strength",1,null,"<Nose_Strength>1.000000</Nose_Strength>","Yes","<Nose_Strength>1.000000</Nose_Strength>"]
["Nose_Rho",0.75,null,"<Nose_Rho>0.750000</Nose_Rho>","Yes","<Nose_Rho>0.750000</Nose_Rho>"]
["Aft_Rho",0.65,null,"<Aft_Rho>0.650000</Aft_Rho>","Yes","<Aft_Rho>0.650000</Aft_Rho>"]
["IML_Flag",0,null,{"$f":"\"<\" & A742 & \">\" & TEXT(B742,0) & \"</\" & A742 & \">\"","v":"<IML_Flag>0</IML_Flag>"},"Yes","<IML_Flag>0</IML_Flag>"]
["Space_Type",1,null,{"$f":"\"<\" & A743 & \">\" & TEXT(B743,0) & \"</\" & A743 & \">\"","v":"<Space_Type>1</Space_Type>"},"Yes","<Space_Type>1</Space_Type>"]
["Nose_Super_Flag",1,null,{"$f":"\"<\" & A744 & \">\" & TEXT(B744,0) & \"</\" & A744 & \">\"","v":"<Nose_Super_Flag>1</Nose_Super_Flag>"},"Yes","<Nose_Super_Flag>1</Nose_Super_Flag>"]
["Aft_Super_Flag",1,null,{"$f":"\"<\" & A745 & \">\" & TEXT(B745,0) & \"</\" & A745 & \">\"","v":"<Aft_Super_Flag>1</Aft_Super_Flag>"},"Yes","<Aft_Super_Flag>1</Aft_Super_Flag>"]
["/Fuse_Parms",null,null,{"$f":"\"<\" & A746 & \">\"","v":"</Fuse_Parms>"},"Yes","</Fuse_Parms>"]
["Cross_Section_List",null,null,{"$f":"\"<\" & A747 & \">\"","v":"<Cross_Section_List>"},"Yes","<Cross_Section_List>"]
["Cross_Section","CrossSection0",null,{"$f":"\"<\" & A748 & \">\"","v":"<Cross_Section>"},"Yes","<Cross_Section>"]
["Num_Pnts",45,null,{"$f":"\"<\" & A749 & \">\" & TEXT(B749,0) & \"</\" & A749 & \">\"","v":"<Num_Pnts>45</Num_Pnts>"},"Yes","<Num_Pnts>45</Num_Pnts>"]
["Spine_Location",0,null,{"$f":"\"<\" & A750 & \">\" & TEXT(B750,\"0.000000\") & \"</\" & A750 & \">\"","v":"<Spine_Location>0.000000</Spine_Location>"},"Yes","<Spine_Location>0.000000</Spine_Location>"]
["Z_Offset",-0.68969999999999998,null,"<Z_Offset>-0.689700</Z_Offset>","Yes","<Z_Offset>-0.689700</Z_Offset>"]
["Top_Thick",0.5,null,"<Top_Thick>0.500000</Top_Thick>","Yes","<Top_Thick>0.500000</Top_Thick>"]
["Bot_Thick",0.5,null,"<Bot_Thick>0.500000</Bot_Thick>","Yes","<Bot_Thick>0.500000</Bot_Thick>"]
["Side_Thick",0.5,null,"<Side_Thick>0.500000</Side_Thick>","Yes","<Side_Thick>0.500000</Side_Thick>"]
["Act_Top_Thick",0.5,null,"<Act_Top_Thick>0.500000</Act_Top_Thick>","Yes","<Act_Top_Thick>0.500000</Act_Top_Thick>"]
["Act_Bot_Thick",0.5,null,"<Act_Bot_Thick>0.500000</Act_Bot_Thick>","Yes","<Act_Bot_Thick>0.500000</Act_Bot_Thick>"]
["Act_Side_Thick",0.5,null,"<Act_Side_Thick>0.500000</Act_Side_Thick>","Yes","<Act_Side_Thick>0.500000</Act_Side_Thick>"]
["IML_X_Offset",0,null,"<IML_X_Offset>0.000000</IML_X_Offset>","Yes","<IML_X_Offset>0.000000</IML_X_Offset>"]
["IML_Z_Offset",0,null,"<IML_Z_Offset>0.000000</IML_Z_Offset>","Yes","<IML_Z_Offset>0.000000</IML_Z_Offset>"]
["ML_Type",0,null,{"$f":"\"<\" & A760 & \">\" & TEXT(B760,0) & \"</\" & A760 & \">\"","v":"<ML_Type>0</ML_Type>"},"Yes","<ML_Type>0</ML_Type>"]
["IML_Flag",0,null,{"$f":"\"<\" & A761 & \">\" & TEXT(B761,0) & \"</\" & A761 & \">\"","v":"<IML_Flag>0</IML_Flag>"},{"$f":"IF(D761=F761,\"Yes\",\"No\")","v":"Yes"},"<IML_Flag>0</IML_Flag>"]
["Profile_Tan_Str_1",0.25,null,{"$f":"\"<\" & A762 & \">\" & TEXT(B762,\"0.000000\") & \"</\" & A762 & \">\"","v":"<Profile_Tan_Str_1>0.250000</Profile_Tan_Str_1>"},"Yes","<Profile_Tan_Str_1>0.250000</Profile_Tan_Str_1>"]
["Profile_Tan_Str_2",0.25,null,{"$f":"\"<\" & A763 & \">\" & TEXT(B763,\"0.000000\") & \"</\" & A763 & \">\"","v":"<Profile_Tan_Str_2>0.250000</Profile_Tan_Str_2>"},"Yes","<Profile_Tan_Str_2>0.250000</Profile_Tan_Str_2>"]
["Profile_Tan_Ang",0,null,{"$f":"\"<\" & A764 & \">\" & TEXT(B764,\"0.000000\") & \"</\" & A764 & \">\"","v":"<Profile_Tan_Ang>0.000000</Profile_Tan_Ang>"},"Yes","<Profile_Tan_Ang>0.000000</Profile_Tan_Ang>"]
["Num_Sect_Interp_1",0,null,{"$f":"\"<\" & A765 & \">\" & TEXT(B765,0) & \"</\" & A765 & \">\"","v":"<Num_Sect_Interp_1>0</Num_Sect_Interp_1>"},"Yes","<Num_Sect_Interp_1>0</Num_Sect_Interp_1>"]
["Num_Sect_Interp_2",6,null,{"$f":"\"<\" & A766 & \">\" & TEXT(B766,0) & \"</\" & A766 & \">\"","v":"<Num_Sect_Interp_2>6</Num_Sect_Interp_2>"},"Yes","<Num_Sect_Interp_2>6</Num_Sect_Interp_2>"]
["OML_Parms",null,null,{"$f":"\"<\" & A767 & \">\"","v":"<OML_Parms>"},"Yes","<OML_Parms>"]
["Type",1,null,{"$f":"\"<\" & A768 & \">\" & TEXT(B768,0) & \"</\" & A768 & \">\"","v":"<Type>1</Type>"},"Yes","<Type>1</Type>"]
["Height",0,null,{"$f":"\"<\" & A769 & \">\" & TEXT(B769,\"0.000000\") & \"</\" & A769 & \">\"","v":"<Height>0.000000</Height>"},"Yes","<Height>0.000000</Height>"]
["Width",0,null,"<Width>0.000000</Width>","Yes","<Width>0.000000</Width>"]
["Max_Width_Location",0,null,"<Max_Width_Location>0.000000</Max_Width_Location>","Yes","<Max_Width_Location>0.000000</Max_Width_Location>"]
["Corner_Radius",0.5,null,"<Corner_Radius>0.500000</Corner_Radius>","Yes","<Corner_Radius>0.500000</Corner_Radius>"]
["Top_Tan_Angle",90,null,"<Top_Tan_Angle>90.000000</Top_Tan_Angle>","Yes","<Top_Tan_Angle>90.000000</Top_Tan_Angle>"]
["Bot_Tan_Angle",90,null,"<Bot_Tan_Angle>90.000000</Bot_Tan_Angle>","Yes","<Bot_Tan_Angle>90.000000</Bot_Tan_Angle>"]
["Top_Tan_Strength",0.83,null,"<Top_Tan_Strength>0.830000</Top_Tan_Strength>","Yes","<Top_Tan_Strength>0.830000</Top_Tan_Strength>"]
["Upper_Tan_Strength",0.83,null,"<Upper_Tan_Strength>0.830000</Upper_Tan_Strength>","Yes","<Upper_Tan_Strength>0.830000</Upper_Tan_Strength>"]
["Lower_Tan_Strength",0.83,null,"<Lower_Tan_Strength>0.830000</Lower_Tan_Strength>","Yes","<Lower_Tan_Strength>0.830000</Lower_Tan_Strength>"]
["Bottom_Tan_Strength",0.83,null,"<Bottom_Tan_Strength>0.830000</Bottom_Tan_Strength>","Yes","<Bottom_Tan_Strength>0.830000</Bottom_Tan_Strength>"]
["/OML_Parms",null,null,{"$f":"\"<\" & A779 & \">\"","v":"</OML_Parms>"},"Yes","</OML_Parms>"]
["IML_Parms",null,null,{"$f":"\"<\" & A780 & \">\"","v":"<IML_Parms>"},"Yes","<IML_Parms>"]
["Type",2,null,{"$f":"\"<\" & A781 & \">\" & TEXT(B781,0) & \"</\" & A781 & \">\"","v":"<Type>2</Type>"},"Yes","<Type>2</Type>"]
["Height",3,null,{"$f":"\"<\" & A782 & \">\" & TEXT(B782,\"0.000000\") & \"</\" & A782 & \">\"","v":"<Height>3.000000</Height>"},"Yes","<Height>3.000000</Height>"]
["Width",2.5,null,"<Width>2.500000</Width>","Yes","<Width>2.500000</Width>"]
["Max_Width_Location",0,null,"<Max_Width_Location>0.000000</Max_Width_Location>","Yes","<Max_Width_Location>0.000000</Max_Width_Location>"]
["Corner_Radius",0.5,null,"<Corner_Radius>0.500000</Corner_Radius>","Yes","<Corner_Radius>0.500000</Corner_Radius>"]
["Top_Tan_Angle",90,null,"<Top_Tan_Angle>90.000000</Top_Tan_Angle>","Yes","<Top_Tan_Angle>90.000000</Top_Tan_Angle>"]
["Bot_Tan_Angle",90,null,"<Bot_Tan_Angle>90.000000</Bot_Tan_Angle>","Yes","<Bot_Tan_Angle>90.000000</Bot_Tan_Angle>"]
["Top_Tan_Strength",0.83,null,"<Top_Tan_Strength>0.830000</Top_Tan_Strength>","Yes","<Top_Tan_Strength>0.830000</Top_Tan_Strength>"]
["Upper_Tan_Strength",0.83,null,"<Upper_Tan_Strength>0.830000</Upper_Tan_Strength>","Yes","<Upper_Tan_Strength>0.830000</Upper_Tan_Strength>"]
["Lower_Tan_Strength",0.83,null,"<Lower_Tan_Strength>0.830000</Lower_Tan_Strength>","Yes","<Lower_Tan_Strength>0.830000</Lower_Tan_Strength>"]
["Bottom_Tan_Strength",0.83,null,"<Bottom_Tan_Strength>0.830000</Bottom_Tan_Strength>","Yes","<Bottom_Tan_Strength>0.830000</Bottom_Tan_Strength>"]
["/IML_Parms",null,null,{"$f":"\"<\" & A792 & \">\"","v":"</IML_Parms>"},"Yes","</IML_Parms>"]
["/Cross_Section",null,null,{"$f":"\"<\" & A793 & \">\"","v":"</Cross_Section>"},"Yes","</Cross_Section>"]
["Cross_Section","CrossSection1",null,{"$f":"\"<\" & A794 & \">\"","v":"<Cross_Section>"},"Yes","<Cross_Section>"]
["Num_Pnts",45,null,{"$f":"\"<\" & A795 & \">\" & TEXT(B795,0) & \"</\" & A795 & \">\"","v":"<Num_Pnts>45</Num_Pnts>"},"Yes","<Num_Pnts>45</Num_Pnts>"]
["Spine_Location",{"$f":"0.33*B888","v":2.145E-2},null,{"$f":"\"<\" & A796 & \">\" & TEXT(B796,\"0.000000\") & \"</\" & A796 & \">\"","v":"<Spine_Location>0.021450</Spine_Location>"},"No","<Spine_Location>0.023727</Spine_Location>"]
["Z_Offset",-0.62070000000000003,null,"<Z_Offset>-0.620700</Z_Offset>","Yes","<Z_Offset>-0.620700</Z_Offset>"]
["Top_Thick",0.5,null,"<Top_Thick>0.500000</Top_Thick>","Yes","<Top_Thick>0.500000</Top_Thick>"]
["Bot_Thick",0.5,null,"<Bot_Thick>0.500000</Bot_Thick>","Yes","<Bot_Thick>0.500000</Bot_Thick>"]
["Side_Thick",0.5,null,"<Side_Thick>0.500000</Side_Thick>","Yes","<Side_Thick>0.500000</Side_Thick>"]
["Act_Top_Thick",0.5,null,"<Act_Top_Thick>0.500000</Act_Top_Thick>","Yes","<Act_Top_Thick>0.500000</Act_Top_Thick>"]
["Act_Bot_Thick",0.5,null,"<Act_Bot_Thick>0.500000</Act_Bot_Thick>","Yes","<Act_Bot_Thick>0.500000</Act_Bot_Thick>"]
["Act_Side_Thick",0.5,null,"<Act_Side_Thick>0.500000</Act_Side_Thick>","Yes","<Act_Side_Thick>0.500000</Act_Side_Thick>"]
["IML_X_Offset",0,null,"<IML_X_Offset>0.000000</IML_X_Offset>","Yes","<IML_X_Offset>0.000000</IML_X_Offset>"]
["IML_Z_Offset",0,null,"<IML_Z_Offset>0.000000</IML_Z_Offset>","Yes","<IML_Z_Offset>0.000000</IML_Z_Offset>"]
["ML_Type",0,null,{"$f":"\"<\" & A806 & \">\" & TEXT(B806,0) & \"</\" & A806 & \">\"","v":"<ML_Type>0</ML_Type>"},"Yes","<ML_Type>0</ML_Type>"]
["IML_Flag",0,null,{"$f":"\"<\" & A807 & \">\" & TEXT(B807,0) & \"</\" & A807 & \">\"","v":"<IML_Flag>0</IML_Flag>"},"Yes","<IML_Flag>0</IML_Flag>"]
["Profile_Tan_Str_1",0.25,null,{"$f":"\"<\" & A808 & \">\" & TEXT(B808,\"0.000000\") & \"</\" & A808 & \">\"","v":"<Profile_Tan_Str_1>0.250000</Profile_Tan_Str_1>"},"Yes","<Profile_Tan_Str_1>0.250000</Profile_Tan_Str_1>"]
["Profile_Tan_Str_2",0.25,null,{"$f":"\"<\" & A809 & \">\" & TEXT(B809,\"0.000000\") & \"</\" & A809 & \">\"","v":"<Profile_Tan_Str_2>0.250000</Profile_Tan_Str_2>"},"Yes","<Profile_Tan_Str_2>0.250000</Profile_Tan_Str_2>"]
["Profile_Tan_Ang",0,null,{"$f":"\"<\" & A810 & \">\" & TEXT(B810,\"0.000000\") & \"</\" & A810 & \">\"","v":"<Profile_Tan_Ang>0.000000</Profile_Tan_Ang>"},"Yes","<Profile_Tan_Ang>0.000000</Profile_Tan_Ang>"]
["Num_Sect_Interp_1",6,null,{"$f":"\"<\" & A811 & \">\" & TEXT(B811,0) & \"</\" & A811 & \">\"","v":"<Num_Sect_Interp_1>6</Num_Sect_Interp_1>"},"Yes","<Num_Sect_Interp_1>6</Num_Sect_Interp_1>"]
["Num_Sect_Interp_2",0,null,{"$f":"\"<\" & A812 & \">\" & TEXT(B812,0) & \"</\" & A812 & \">\"","v":"<Num_Sect_Interp_2>0</Num_Sect_Interp_2>"},"Yes","<Num_Sect_Interp_2>0</Num_Sect_Interp_2>"]
["OML_Parms",null,null,{"$f":"\"<\" & A813 & \">\"","v":"<OML_Parms>"},"Yes","<OML_Parms>"]
["Type",1,null,{"$f":"\"<\" & A814 & \">\" & TEXT(B814,0) & \"</\" & A814 & \">\"","v":"<Type>1</Type>"},"Yes","<Type>1</Type>"]
["Height",{"$f":"0.425*d_F","v":2.4781750000000002},null,{"$f":"\"<\" & A815 & \">\" & TEXT(B815,\"0.000000\") & \"</\" & A815 & \">\"","v":"<Height>2.478175</Height>"},"No","<Height>1.683000</Height>"]
["Width",{"$f":"B815","v":2.4781750000000002},null,"<Width>2.478175</Width>","No","<Width>1.683000</Width>"]
["Max_Width_Location",0,null,"<Max_Width_Location>0.000000</Max_Width_Location>","Yes","<Max_Width_Location>0.000000</Max_Width_Location>"]
["Corner_Radius",0.5,null,"<Corner_Radius>0.500000</Corner_Radius>","Yes","<Corner_Radius>0.500000</Corner_Radius>"]
["Top_Tan_Angle",90,null,"<Top_Tan_Angle>90.000000</Top_Tan_Angle>","Yes","<Top_Tan_Angle>90.000000</Top_Tan_Angle>"]
["Bot_Tan_Angle",90,null,"<Bot_Tan_Angle>90.000000</Bot_Tan_Angle>","Yes","<Bot_Tan_Angle>90.000000</Bot_Tan_Angle>"]
["Top_Tan_Strength",0.83,null,"<Top_Tan_Strength>0.830000</Top_Tan_Strength>","Yes","<Top_Tan_Strength>0.830000</Top_Tan_Strength>"]
["Upper_Tan_Strength",0.83,null,"<Upper_Tan_Strength>0.830000</Upper_Tan_Strength>","Yes","<Upper_Tan_Strength>0.830000</Upper_Tan_Strength>"]
["Lower_Tan_Strength",0.83,null,"<Lower_Tan_Strength>0.830000</Lower_Tan_Strength>","Yes","<Lower_Tan_Strength>0.830000</Lower_Tan_Strength>"]
["Bottom_Tan_Strength",0.83,null,"<Bottom_Tan_Strength>0.830000</Bottom_Tan_Strength>","Yes","<Bottom_Tan_Strength>0.830000</Bottom_Tan_Strength>"]
["/OML_Parms",null,null,{"$f":"\"<\" & A825 & \">\"","v":"</OML_Parms>"},{"$f":"IF(D825=F825,\"Yes\",\"No\")","v":"Yes"},"</OML_Parms>"]
["IML_Parms",null,null,{"$f":"\"<\" & A826 & \">\"","v":"<IML_Parms>"},"Yes","<IML_Parms>"]
["Type",2,null,{"$f":"\"<\" & A827 & \">\" & TEXT(B827,0) & \"</\" & A827 & \">\"","v":"<Type>2</Type>"},"Yes","<Type>2</Type>"]
["Height",3,null,{"$f":"\"<\" & A828 & \">\" & TEXT(B828,\"0.000000\") & \"</\" & A828 & \">\"","v":"<Height>3.000000</Height>"},"Yes","<Height>3.000000</Height>"]
["Width",2.5,null,"<Width>2.500000</Width>","Yes","<Width>2.500000</Width>"]
["Max_Width_Location",0,null,"<Max_Width_Location>0.000000</Max_Width_Location>","Yes","<Max_Width_Location>0.000000</Max_Width_Location>"]
["Corner_Radius",0.5,null,"<Corner_Radius>0.500000</Corner_Radius>","Yes","<Corner_Radius>0.500000</Corner_Radius>"]
["Top_Tan_Angle",90,null,"<Top_Tan_Angle>90.000000</Top_Tan_Angle>","Yes","<Top_Tan_Angle>90.000000</Top_Tan_Angle>"]
["Bot_Tan_Angle",90,null,"<Bot_Tan_Angle>90.000000</Bot_Tan_Angle>","Yes","<Bot_Tan_Angle>90.000000</Bot_Tan_Angle>"]
["Top_Tan_Strength",0.83,null,"<Top_Tan_Strength>0.830000</Top_Tan_Strength>","Yes","<Top_Tan_Strength>0.830000</Top_Tan_Strength>"]
["Upper_Tan_Strength",0.83,null,"<Upper_Tan_Strength>0.830000</Upper_Tan_Strength>","Yes","<Upper_Tan_Strength>0.830000</Upper_Tan_Strength>"]
["Lower_Tan_Strength",0.83,null,"<Lower_Tan_Strength>0.830000</Lower_Tan_Strength>","Yes","<Lower_Tan_Strength>0.830000</Lower_Tan_Strength>"]
["Bottom_Tan_Strength",0.83,null,"<Bottom_Tan_Strength>0.830000</Bottom_Tan_Strength>","Yes","<Bottom_Tan_Strength>0.830000</Bottom_Tan_Strength>"]
["/IML_Parms",null,null,{"$f":"\"<\" & A838 & \">\"","v":"</IML_Parms>"},"Yes","</IML_Parms>"]
["/Cross_Section",null,null,{"$f":"\"<\" & A839 & \">\"","v":"</Cross_Section>"},"Yes","</Cross_Section>"]
["Cross_Section","CrossSection2",null,{"$f":"\"<\" & A840 & \">\"","v":"<Cross_Section>"},"Yes","<Cross_Section>"]
["Num_Pnts",45,null,{"$f":"\"<\" & A841 & \">\" & TEXT(B841,0) & \"</\" & A841 & \">\"","v":"<Num_Pnts>45</Num_Pnts>"},"Yes","<Num_Pnts>45</Num_Pnts>"]
["Spine_Location",{"$f":"0.618*B888","v":4.0170000000000004E-2},null,{"$f":"\"<\" & A842 & \">\" & TEXT(B842,\"0.000000\") & \"</\" & A842 & \">\"","v":"<Spine_Location>0.040170</Spine_Location>"},"No","<Spine_Location>0.044434</Spine_Location>"]
["Z_Offset",-0.55430000000000001,null,"<Z_Offset>-0.554300</Z_Offset>","Yes","<Z_Offset>-0.554300</Z_Offset>"]
["Top_Thick",0.5,null,"<Top_Thick>0.500000</Top_Thick>","Yes","<Top_Thick>0.500000</Top_Thick>"]
["Bot_Thick",0.5,null,"<Bot_Thick>0.500000</Bot_Thick>","Yes","<Bot_Thick>0.500000</Bot_Thick>"]
["Side_Thick",0.5,null,"<Side_Thick>0.500000</Side_Thick>","Yes","<Side_Thick>0.500000</Side_Thick>"]
["Act_Top_Thick",0.5,null,"<Act_Top_Thick>0.500000</Act_Top_Thick>","Yes","<Act_Top_Thick>0.500000</Act_Top_Thick>"]
["Act_Bot_Thick",0.5,null,"<Act_Bot_Thick>0.500000</Act_Bot_Thick>","Yes","<Act_Bot_Thick>0.500000</Act_Bot_Thick>"]
["Act_Side_Thick",0.5,null,"<Act_Side_Thick>0.500000</Act_Side_Thick>","Yes","<Act_Side_Thick>0.500000</Act_Side_Thick>"]
["IML_X_Offset",0,null,"<IML_X_Offset>0.000000</IML_X_Offset>","Yes","<IML_X_Offset>0.000000</IML_X_Offset>"]
["IML_Z_Offset",0,null,"<IML_Z_Offset>0.000000</IML_Z_Offset>","Yes","<IML_Z_Offset>0.000000</IML_Z_Offset>"]
["ML_Type",0,null,{"$f":"\"<\" & A852 & \">\" & TEXT(B852,0) & \"</\" & A852 & \">\"","v":"<ML_Type>0</ML_Type>"},"Yes","<ML_Type>0</ML_Type>"]
["IML_Flag",0,null,{"$f":"\"<\" & A853 & \">\" & TEXT(B853,0) & \"</\" & A853 & \">\"","v":"<IML_Flag>0</IML_Flag>"},"Yes","<IML_Flag>0</IML_Flag>"]
["Profile_Tan_Str_1",0.25,null,{"$f":"\"<\" & A854 & \">\" & TEXT(B854,\"0.000000\") & \"</\" & A854 & \">\"","v":"<Profile_Tan_Str_1>0.250000</Profile_Tan_Str_1>"},"Yes","<Profile_Tan_Str_1>0.250000</Profile_Tan_Str_1>"]
["Profile_Tan_Str_2",0.25,null,{"$f":"\"<\" & A855 & \">\" & TEXT(B855,\"0.000000\") & \"</\" & A855 & \">\"","v":"<Profile_Tan_Str_2>0.250000</Profile_Tan_Str_2>"},"Yes","<Profile_Tan_Str_2>0.250000</Profile_Tan_Str_2>"]
["Profile_Tan_Ang",0,null,{"$f":"\"<\" & A856 & \">\" & TEXT(B856,\"0.000000\") & \"</\" & A856 & \">\"","v":"<Profile_Tan_Ang>0.000000</Profile_Tan_Ang>"},"Yes","<Profile_Tan_Ang>0.000000</Profile_Tan_Ang>"]
["Num_Sect_Interp_1",0,null,{"$f":"\"<\" & A857 & \">\" & TEXT(B857,0) & \"</\" & A857 & \">\"","v":"<Num_Sect_Interp_1>0</Num_Sect_Interp_1>"},"Yes","<Num_Sect_Interp_1>0</Num_Sect_Interp_1>"]
["Num_Sect_Interp_2",0,null,{"$f":"\"<\" & A858 & \">\" & TEXT(B858,0) & \"</\" & A858 & \">\"","v":"<Num_Sect_Interp_2>0</Num_Sect_Interp_2>"},"Yes","<Num_Sect_Interp_2>0</Num_Sect_Interp_2>"]
["OML_Parms",null,null,{"$f":"\"<\" & A859 & \">\"","v":"<OML_Parms>"},"Yes","<OML_Parms>"]
["Type",1,null,{"$f":"\"<\" & A860 & \">\" & TEXT(B860,0) & \"</\" & A860 & \">\"","v":"<Type>1</Type>"},"Yes","<Type>1</Type>"]
["Height",{"$f":"0.557*$B$999","v":3.2478670000000007},null,{"$f":"\"<\" & A861 & \">\" & TEXT(B861,\"0.000000\") & \"</\" & A861 & \">\"","v":"<Height>3.247867</Height>"},"No","<Height>2.205720</Height>"]
["Width",{"$f":"B861","v":3.2478670000000007},null,"<Width>3.247867</Width>","No","<Width>2.205720</Width>"]
["Max_Width_Location",0,null,"<Max_Width_Location>0.000000</Max_Width_Location>","Yes","<Max_Width_Location>0.000000</Max_Width_Location>"]
["Corner_Radius",0.5,null,"<Corner_Radius>0.500000</Corner_Radius>","Yes","<Corner_Radius>0.500000</Corner_Radius>"]
["Top_Tan_Angle",90,null,"<Top_Tan_Angle>90.000000</Top_Tan_Angle>","Yes","<Top_Tan_Angle>90.000000</Top_Tan_Angle>"]
["Bot_Tan_Angle",90,null,"<Bot_Tan_Angle>90.000000</Bot_Tan_Angle>","Yes","<Bot_Tan_Angle>90.000000</Bot_Tan_Angle>"]
["Top_Tan_Strength",0.83,null,"<Top_Tan_Strength>0.830000</Top_Tan_Strength>","Yes","<Top_Tan_Strength>0.830000</Top_Tan_Strength>"]
["Upper_Tan_Strength",0.83,null,"<Upper_Tan_Strength>0.830000</Upper_Tan_Strength>","Yes","<Upper_Tan_Strength>0.830000</Upper_Tan_Strength>"]
["Lower_Tan_Strength",0.83,null,"<Lower_Tan_Strength>0.830000</Lower_Tan_Strength>","Yes","<Lower_Tan_Strength>0.830000</Lower_Tan_Strength>"]
["Bottom_Tan_Strength",0.83,null,"<Bottom_Tan_Strength>0.830000</Bottom_Tan_Strength>","Yes","<Bottom_Tan_Strength>0.830000</Bottom_Tan_Strength>"]
["/OML_Parms",null,null,{"$f":"\"<\" & A871 & \">\"","v":"</OML_Parms>"},"Yes","</OML_Parms>"]
["IML_Parms",null,null,{"$f":"\"<\" & A872 & \">\"","v":"<IML_Parms>"},"Yes","<IML_Parms>"]
["Type",2,null,{"$f":"\"<\" & A873 & \">\" & TEXT(B873,0) & \"</\" & A873 & \">\"","v":"<Type>2</Type>"},"Yes","<Type>2</Type>"]
["Height",3,null,{"$f":"\"<\" & A874 & \">\" & TEXT(B874,\"0.000000\") & \"</\" & A874 & \">\"","v":"<Height>3.000000</Height>"},"Yes","<Height>3.000000</Height>"]
["Width",2.5,null,"<Width>2.500000</Width>","Yes","<Width>2.500000</Width>"]
["Max_Width_Location",0,null,"<Max_Width_Location>0.000000</Max_Width_Location>","Yes","<Max_Width_Location>0.000000</Max_Width_Location>"]
["Corner_Radius",0.5,null,"<Corner_Radius>0.500000</Corner_Radius>","Yes","<Corner_Radius>0.500000</Corner_Radius>"]
["Top_Tan_Angle",90,null,"<Top_Tan_Angle>90.000000</Top_Tan_Angle>","Yes","<Top_Tan_Angle>90.000000</Top_Tan_Angle>"]
["Bot_Tan_Angle",90,null,"<Bot_Tan_Angle>90.000000</Bot_Tan_Angle>","Yes","<Bot_Tan_Angle>90.000000</Bot_Tan_Angle>"]
["Top_Tan_Strength",0.83,null,"<Top_Tan_Strength>0.830000</Top_Tan_Strength>","Yes","<Top_Tan_Strength>0.830000</Top_Tan_Strength>"]
["Upper_Tan_Strength",0.83,null,"<Upper_Tan_Strength>0.830000</Upper_Tan_Strength>","Yes","<Upper_Tan_Strength>0.830000</Upper_Tan_Strength>"]
["Lower_Tan_Strength",0.83,null,"<Lower_Tan_Strength>0.830000</Lower_Tan_Strength>","Yes","<Lower_Tan_Strength>0.830000</Lower_Tan_Strength>"]
["Bottom_Tan_Strength",0.83,null,"<Bottom_Tan_Strength>0.830000</Bottom_Tan_Strength>","Yes","<Bottom_Tan_Strength>0.830000</Bottom_Tan_Strength>"]
["/IML_Parms",null,null,{"$f":"\"<\" & A884 & \">\"","v":"</IML_Parms>"},"Yes","</IML_Parms>"]
["/Cross_Section",null,null,{"$f":"\"<\" & A885 & \">\"","v":"</Cross_Section>"},"Yes","</Cross_Section>"]
["Cross_Section","CrossSection3",null,{"$f":"\"<\" & A886 & \">\"","v":"<Cross_Section>"},"Yes","<Cross_Section>"]
["Num_Pnts",45,null,{"$f":"\"<\" & A887 & \">\" & TEXT(B887,0) & \"</\" & A887 & \">\"","v":"<Num_Pnts>45</Num_Pnts>"},"Yes","<Num_Pnts>45</Num_Pnts>"]
["Spine_Location",{"$f":"l_cock.F/l_F","v":6.5000000000000002E-2},null,{"$f":"\"<\" & A888 & \">\" & TEXT(B888,\"0.000000\") & \"</\" & A888 & \">\"","v":"<Spine_Location>0.065000</Spine_Location>"},"No","<Spine_Location>0.071899</Spine_Location>"]
["Z_Offset",-0.2268,null,"<Z_Offset>-0.226800</Z_Offset>",{"$f":"IF(D889=F889,\"Yes\",\"No\")","v":"Yes"},"<Z_Offset>-0.226800</Z_Offset>"]
["Top_Thick",0.5,null,"<Top_Thick>0.500000</Top_Thick>","Yes","<Top_Thick>0.500000</Top_Thick>"]
["Bot_Thick",0.5,null,"<Bot_Thick>0.500000</Bot_Thick>","Yes","<Bot_Thick>0.500000</Bot_Thick>"]
["Side_Thick",0.5,null,"<Side_Thick>0.500000</Side_Thick>","Yes","<Side_Thick>0.500000</Side_Thick>"]
["Act_Top_Thick",0.5,null,"<Act_Top_Thick>0.500000</Act_Top_Thick>","Yes","<Act_Top_Thick>0.500000</Act_Top_Thick>"]
["Act_Bot_Thick",0.5,null,"<Act_Bot_Thick>0.500000</Act_Bot_Thick>","Yes","<Act_Bot_Thick>0.500000</Act_Bot_Thick>"]
["Act_Side_Thick",0.5,null,"<Act_Side_Thick>0.500000</Act_Side_Thick>","Yes","<Act_Side_Thick>0.500000</Act_Side_Thick>"]
["IML_X_Offset",0,null,"<IML_X_Offset>0.000000</IML_X_Offset>","Yes","<IML_X_Offset>0.000000</IML_X_Offset>"]
["IML_Z_Offset",0,null,"<IML_Z_Offset>0.000000</IML_Z_Offset>","Yes","<IML_Z_Offset>0.000000</IML_Z_Offset>"]
["ML_Type",0,null,{"$f":"\"<\" & A898 & \">\" & TEXT(B898,0) & \"</\" & A898 & \">\"","v":"<ML_Type>0</ML_Type>"},"Yes","<ML_Type>0</ML_Type>"]
["IML_Flag",0,null,{"$f":"\"<\" & A899 & \">\" & TEXT(B899,0) & \"</\" & A899 & \">\"","v":"<IML_Flag>0</IML_Flag>"},"Yes","<IML_Flag>0</IML_Flag>"]
["Profile_Tan_Str_1",0.25,null,{"$f":"\"<\" & A900 & \">\" & TEXT(B900,\"0.000000\") & \"</\" & A900 & \">\"","v":"<Profile_Tan_Str_1>0.250000</Profile_Tan_Str_1>"},"Yes","<Profile_Tan_Str_1>0.250000</Profile_Tan_Str_1>"]
["Profile_Tan_Str_2",0.25,null,{"$f":"\"<\" & A901 & \">\" & TEXT(B901,\"0.000000\") & \"</\" & A901 & \">\"","v":"<Profile_Tan_Str_2>0.250000</Profile_Tan_Str_2>"},"Yes","<Profile_Tan_Str_2>0.250000</Profile_Tan_Str_2>"]
["Profile_Tan_Ang",0,null,{"$f":"\"<\" & A902 & \">\" & TEXT(B902,\"0.000000\") & \"</\" & A902 & \">\"","v":"<Profile_Tan_Ang>0.000000</Profile_Tan_Ang>"},"Yes","<Profile_Tan_Ang>0.000000</Profile_Tan_Ang>"]
["Num_Sect_Interp_1",0,null,{"$f":"\"<\" & A903 & \">\" & TEXT(B903,0) & \"</\" & A903 & \">\"","v":"<Num_Sect_Interp_1>0</Num_Sect_Interp_1>"},"Yes","<Num_Sect_Interp_1>0</Num_Sect_Interp_1>"]
["Num_Sect_Interp_2",0,null,{"$f":"\"<\" & A904 & \">\" & TEXT(B904,0) & \"</\" & A904 & \">\"","v":"<Num_Sect_Interp_2>0</Num_Sect_Interp_2>"},"Yes","<Num_Sect_Interp_2>0</Num_Sect_Interp_2>"]
["OML_Parms",null,null,{"$f":"\"<\" & A905 & \">\"","v":"<OML_Parms>"},"Yes","<OML_Parms>"]
["Type",1,null,{"$f":"\"<\" & A906 & \">\" & TEXT(B906,0) & \"</\" & A906 & \">\"","v":"<Type>1</Type>"},"Yes","<Type>1</Type>"]
["Height",{"$f":"0.796*$B$999","v":4.6414760000000008},null,{"$f":"\"<\" & A907 & \">\" & TEXT(B907,\"0.000000\") & \"</\" & A907 & \">\"","v":"<Height>4.641476</Height>"},"No","<Height>3.152160</Height>"]
["Width",{"$f":"B907","v":4.6414760000000008},null,"<Width>4.641476</Width>","No","<Width>3.152160</Width>"]
["Max_Width_Location",0,null,"<Max_Width_Location>0.000000</Max_Width_Location>","Yes","<Max_Width_Location>0.000000</Max_Width_Location>"]
["Corner_Radius",0.5,null,"<Corner_Radius>0.500000</Corner_Radius>","Yes","<Corner_Radius>0.500000</Corner_Radius>"]
["Top_Tan_Angle",90,null,"<Top_Tan_Angle>90.000000</Top_Tan_Angle>","Yes","<Top_Tan_Angle>90.000000</Top_Tan_Angle>"]
["Bot_Tan_Angle",90,null,"<Bot_Tan_Angle>90.000000</Bot_Tan_Angle>","Yes","<Bot_Tan_Angle>90.000000</Bot_Tan_Angle>"]
["Top_Tan_Strength",0.83,null,"<Top_Tan_Strength>0.830000</Top_Tan_Strength>","Yes","<Top_Tan_Strength>0.830000</Top_Tan_Strength>"]
["Upper_Tan_Strength",0.83,null,"<Upper_Tan_Strength>0.830000</Upper_Tan_Strength>","Yes","<Upper_Tan_Strength>0.830000</Upper_Tan_Strength>"]
["Lower_Tan_Strength",0.83,null,"<Lower_Tan_Strength>0.830000</Lower_Tan_Strength>","Yes","<Lower_Tan_Strength>0.830000</Lower_Tan_Strength>"]
["Bottom_Tan_Strength",0.83,null,"<Bottom_Tan_Strength>0.830000</Bottom_Tan_Strength>","Yes","<Bottom_Tan_Strength>0.830000</Bottom_Tan_Strength>"]
["/OML_Parms",null,null,{"$f":"\"<\" & A917 & \">\"","v":"</OML_Parms>"},"Yes","</OML_Parms>"]
["IML_Parms",null,null,{"$f":"\"<\" & A918 & \">\"","v":"<IML_Parms>"},"Yes","<IML_Parms>"]
["Type",2,null,{"$f":"\"<\" & A919 & \">\" & TEXT(B919,0) & \"</\" & A919 & \">\"","v":"<Type>2</Type>"},"Yes","<Type>2</Type>"]
["Height",3,null,{"$f":"\"<\" & A920 & \">\" & TEXT(B920,\"0.000000\") & \"</\" & A920 & \">\"","v":"<Height>3.000000</Height>"},"Yes","<Height>3.000000</Height>"]
["Width",2.5,null,"<Width>2.500000</Width>","Yes","<Width>2.500000</Width>"]
["Max_Width_Location",0,null,"<Max_Width_Location>0.000000</Max_Width_Location>","Yes","<Max_Width_Location>0.000000</Max_Width_Location>"]
["Corner_Radius",0.5,null,"<Corner_Radius>0.500000</Corner_Radius>","Yes","<Corner_Radius>0.500000</Corner_Radius>"]
["Top_Tan_Angle",90,null,"<Top_Tan_Angle>90.000000</Top_Tan_Angle>","Yes","<Top_Tan_Angle>90.000000</Top_Tan_Angle>"]
["Bot_Tan_Angle",90,null,"<Bot_Tan_Angle>90.000000</Bot_Tan_Angle>","Yes","<Bot_Tan_Angle>90.000000</Bot_Tan_Angle>"]
["Top_Tan_Strength",0.83,null,"<Top_Tan_Strength>0.830000</Top_Tan_Strength>","Yes","<Top_Tan_Strength>0.830000</Top_Tan_Strength>"]
["Upper_Tan_Strength",0.83,null,"<Upper_Tan_Strength>0.830000</Upper_Tan_Strength>","Yes","<Upper_Tan_Strength>0.830000</Upper_Tan_Strength>"]
["Lower_Tan_Strength",0.83,null,"<Lower_Tan_Strength>0.830000</Lower_Tan_Strength>","Yes","<Lower_Tan_Strength>0.830000</Lower_Tan_Strength>"]
["Bottom_Tan_Strength",0.83,null,"<Bottom_Tan_Strength>0.830000</Bottom_Tan_Strength>","Yes","<Bottom_Tan_Strength>0.830000</Bottom_Tan_Strength>"]
["/IML_Parms",null,null,{"$f":"\"<\" & A930 & \">\"","v":"</IML_Parms>"},"Yes","</IML_Parms>"]
["/Cross_Section",null,null,{"$f":"\"<\" & A931 & \">\"","v":"</Cross_Section>"},"Yes","</Cross_Section>"]
["Cross_Section","CrossSection4",null,{"$f":"\"<\" & A932 & \">\"","v":"<Cross_Section>"},"Yes","<Cross_Section>"]
["Num_Pnts",45,null,{"$f":"\"<\" & A933 & \">\" & TEXT(B933,0) & \"</\" & A933 & \">\"","v":"<Num_Pnts>45</Num_Pnts>"},"Yes","<Num_Pnts>45</Num_Pnts>"]
["Spine_Location",{"$f":"0.62*$B$980","v":0.12068609999999991},null,{"$f":"\"<\" & A934 & \">\" & TEXT(B934,\"0.000000\") & \"</\" & A934 & \">\"","v":"<Spine_Location>0.120686</Spine_Location>"},"No","<Spine_Location>0.107427</Spine_Location>"]
["Z_Offset",-7.6499999999999999E-2,null,"<Z_Offset>-0.076500</Z_Offset>","Yes","<Z_Offset>-0.076500</Z_Offset>"]
["Top_Thick",0.5,null,"<Top_Thick>0.500000</Top_Thick>","Yes","<Top_Thick>0.500000</Top_Thick>"]
["Bot_Thick",0.5,null,"<Bot_Thick>0.500000</Bot_Thick>","Yes","<Bot_Thick>0.500000</Bot_Thick>"]
["Side_Thick",0.5,null,"<Side_Thick>0.500000</Side_Thick>","Yes","<Side_Thick>0.500000</Side_Thick>"]
["Act_Top_Thick",0.5,null,"<Act_Top_Thick>0.500000</Act_Top_Thick>","Yes","<Act_Top_Thick>0.500000</Act_Top_Thick>"]
["Act_Bot_Thick",0.5,null,"<Act_Bot_Thick>0.500000</Act_Bot_Thick>","Yes","<Act_Bot_Thick>0.500000</Act_Bot_Thick>"]
["Act_Side_Thick",0.5,null,"<Act_Side_Thick>0.500000</Act_Side_Thick>","Yes","<Act_Side_Thick>0.500000</Act_Side_Thick>"]
["IML_X_Offset",0,null,"<IML_X_Offset>0.000000</IML_X_Offset>","Yes","<IML_X_Offset>0.000000</IML_X_Offset>"]
["IML_Z_Offset",0,null,"<IML_Z_Offset>0.000000</IML_Z_Offset>","Yes","<IML_Z_Offset>0.000000</IML_Z_Offset>"]
["ML_Type",0,null,{"$f":"\"<\" & A944 & \">\" & TEXT(B944,0) & \"</\" & A944 & \">\"","v":"<ML_Type>0</ML_Type>"},"Yes","<ML_Type>0</ML_Type>"]
["IML_Flag",0,null,{"$f":"\"<\" & A945 & \">\" & TEXT(B945,0) & \"</\" & A945 & \">\"","v":"<IML_Flag>0</IML_Flag>"},"Yes","<IML_Flag>0</IML_Flag>"]
["Profile_Tan_Str_1",0.25,null,{"$f":"\"<\" & A946 & \">\" & TEXT(B946,\"0.000000\") & \"</\" & A946 & \">\"","v":"<Profile_Tan_Str_1>0.250000</Profile_Tan_Str_1>"},"Yes","<Profile_Tan_Str_1>0.250000</Profile_Tan_Str_1>"]
["Profile_Tan_Str_2",0.25,null,{"$f":"\"<\" & A947 & \">\" & TEXT(B947,\"0.000000\") & \"</\" & A947 & \">\"","v":"<Profile_Tan_Str_2>0.250000</Profile_Tan_Str_2>"},"Yes","<Profile_Tan_Str_2>0.250000</Profile_Tan_Str_2>"]
["Profile_Tan_Ang",0,null,{"$f":"\"<\" & A948 & \">\" & TEXT(B948,\"0.000000\") & \"</\" & A948 & \">\"","v":"<Profile_Tan_Ang>0.000000</Profile_Tan_Ang>"},"Yes","<Profile_Tan_Ang>0.000000</Profile_Tan_Ang>"]
["Num_Sect_Interp_1",0,null,{"$f":"\"<\" & A949 & \">\" & TEXT(B949,0) & \"</\" & A949 & \">\"","v":"<Num_Sect_Interp_1>0</Num_Sect_Interp_1>"},"Yes","<Num_Sect_Interp_1>0</Num_Sect_Interp_1>"]
["Num_Sect_Interp_2",0,null,{"$f":"\"<\" & A950 & \">\" & TEXT(B950,0) & \"</\" & A950 & \">\"","v":"<Num_Sect_Interp_2>0</Num_Sect_Interp_2>"},"Yes","<Num_Sect_Interp_2>0</Num_Sect_Interp_2>"]
["OML_Parms",null,null,{"$f":"\"<\" & A951 & \">\"","v":"<OML_Parms>"},"Yes","<OML_Parms>"]
["Type",1,null,{"$f":"\"<\" & A952 & \">\" & TEXT(B952,0) & \"</\" & A952 & \">\"","v":"<Type>1</Type>"},"Yes","<Type>1</Type>"]
["Height",{"$f":"0.91*$B$999","v":5.306210000000001},null,{"$f":"\"<\" & A953 & \">\" & TEXT(B953,\"0.000000\") & \"</\" & A953 & \">\"","v":"<Height>5.306210</Height>"},{"$f":"IF(D953=F953,\"Yes\",\"No\")","v":"No"},"<Height>3.603600</Height>"]
["Width",{"$f":"B953","v":5.306210000000001},null,"<Width>5.306210</Width>","No","<Width>3.603600</Width>"]
["Max_Width_Location",0,null,"<Max_Width_Location>0.000000</Max_Width_Location>","Yes","<Max_Width_Location>0.000000</Max_Width_Location>"]
["Corner_Radius",0.5,null,"<Corner_Radius>0.500000</Corner_Radius>","Yes","<Corner_Radius>0.500000</Corner_Radius>"]
["Top_Tan_Angle",90,null,"<Top_Tan_Angle>90.000000</Top_Tan_Angle>","Yes","<Top_Tan_Angle>90.000000</Top_Tan_Angle>"]
["Bot_Tan_Angle",90,null,"<Bot_Tan_Angle>90.000000</Bot_Tan_Angle>","Yes","<Bot_Tan_Angle>90.000000</Bot_Tan_Angle>"]
["Top_Tan_Strength",0.83,null,"<Top_Tan_Strength>0.830000</Top_Tan_Strength>","Yes","<Top_Tan_Strength>0.830000</Top_Tan_Strength>"]
["Upper_Tan_Strength",0.83,null,"<Upper_Tan_Strength>0.830000</Upper_Tan_Strength>","Yes","<Upper_Tan_Strength>0.830000</Upper_Tan_Strength>"]
["Lower_Tan_Strength",0.83,null,"<Lower_Tan_Strength>0.830000</Lower_Tan_Strength>","Yes","<Lower_Tan_Strength>0.830000</Lower_Tan_Strength>"]
["Bottom_Tan_Strength",0.83,null,"<Bottom_Tan_Strength>0.830000</Bottom_Tan_Strength>","Yes","<Bottom_Tan_Strength>0.830000</Bottom_Tan_Strength>"]
["/OML_Parms",null,null,{"$f":"\"<\" & A963 & \">\"","v":"</OML_Parms>"},"Yes","</OML_Parms>"]
["IML_Parms",null,null,{"$f":"\"<\" & A964 & \">\"","v":"<IML_Parms>"},"Yes","<IML_Parms>"]
["Type",2,null,{"$f":"\"<\" & A965 & \">\" & TEXT(B965,0) & \"</\" & A965 & \">\"","v":"<Type>2</Type>"},"Yes","<Type>2</Type>"]
["Height",3,null,{"$f":"\"<\" & A966 & \">\" & TEXT(B966,\"0.000000\") & \"</\" & A966 & \">\"","v":"<Height>3.000000</Height>"},"Yes","<Height>3.000000</Height>"]
["Width",2.5,null,"<Width>2.500000</Width>","Yes","<Width>2.500000</Width>"]
["Max_Width_Location",0,null,"<Max_Width_Location>0.000000</Max_Width_Location>","Yes","<Max_Width_Location>0.000000</Max_Width_Location>"]
["Corner_Radius",0.5,null,"<Corner_Radius>0.500000</Corner_Radius>","Yes","<Corner_Radius>0.500000</Corner_Radius>"]
["Top_Tan_Angle",90,null,"<Top_Tan_Angle>90.000000</Top_Tan_Angle>","Yes","<Top_Tan_Angle>90.000000</Top_Tan_Angle>"]
["Bot_Tan_Angle",90,null,"<Bot_Tan_Angle>90.000000</Bot_Tan_Angle>","Yes","<Bot_Tan_Angle>90.000000</Bot_Tan_Angle>"]
["Top_Tan_Strength",0.83,null,"<Top_Tan_Strength>0.830000</Top_Tan_Strength>","Yes","<Top_Tan_Strength>0.830000</Top_Tan_Strength>"]
["Upper_Tan_Strength",0.83,null,"<Upper_Tan_Strength>0.830000</Upper_Tan_Strength>","Yes","<Upper_Tan_Strength>0.830000</Upper_Tan_Strength>"]
["Lower_Tan_Strength",0.83,null,"<Lower_Tan_Strength>0.830000</Lower_Tan_Strength>","Yes","<Lower_Tan_Strength>0.830000</Lower_Tan_Strength>"]
["Bottom_Tan_Strength",0.83,null,"<Bottom_Tan_Strength>0.830000</Bottom_Tan_Strength>","Yes","<Bottom_Tan_Strength>0.830000</Bottom_Tan_Strength>"]
["/IML_Parms",null,null,{"$f":"\"<\" & A976 & \">\"","v":"</IML_Parms>"},"Yes","</IML_Parms>"]
["/Cross_Section",null,null,{"$f":"\"<\" & A977 & \">\"","v":"</Cross_Section>"},"Yes","</Cross_Section>"]
["Cross_Section","CrossSection5",null,{"$f":"\"<\" & A978 & \">\"","v":"<Cross_Section>"},"Yes","<Cross_Section>"]
["Num_Pnts",45,null,{"$f":"\"<\" & A979 & \">\" & TEXT(B979,0) & \"</\" & A979 & \">\"","v":"<Num_Pnts>45</Num_Pnts>"},"Yes","<Num_Pnts>45</Num_Pnts>"]
["Spine_Location",{"$f":"l_nose.F/l_F","v":0.19465499999999986},null,{"$f":"\"<\" & A980 & \">\" & TEXT(B980,\"0.000000\") & \"</\" & A980 & \">\"","v":"<Spine_Location>0.194655</Spine_Location>"},"No","<Spine_Location>0.173269</Spine_Location>"]
["Z_Offset",0,null,"<Z_Offset>0.000000</Z_Offset>","Yes","<Z_Offset>0.000000</Z_Offset>"]
["Top_Thick",0.5,null,"<Top_Thick>0.500000</Top_Thick>","Yes","<Top_Thick>0.500000</Top_Thick>"]
["Bot_Thick",0.5,null,"<Bot_Thick>0.500000</Bot_Thick>","Yes","<Bot_Thick>0.500000</Bot_Thick>"]
["Side_Thick",0.5,null,"<Side_Thick>0.500000</Side_Thick>","Yes","<Side_Thick>0.500000</Side_Thick>"]
["Act_Top_Thick",0.5,null,"<Act_Top_Thick>0.500000</Act_Top_Thick>","Yes","<Act_Top_Thick>0.500000</Act_Top_Thick>"]
["Act_Bot_Thick",0.5,null,"<Act_Bot_Thick>0.500000</Act_Bot_Thick>","Yes","<Act_Bot_Thick>0.500000</Act_Bot_Thick>"]
["Act_Side_Thick",0.5,null,"<Act_Side_Thick>0.500000</Act_Side_Thick>","Yes","<Act_Side_Thick>0.500000</Act_Side_Thick>"]
["IML_X_Offset",0,null,"<IML_X_Offset>0.000000</IML_X_Offset>","Yes","<IML_X_Offset>0.000000</IML_X_Offset>"]
["IML_Z_Offset",0,null,"<IML_Z_Offset>0.000000</IML_Z_Offset>","Yes","<IML_Z_Offset>0.000000</IML_Z_Offset>"]
["ML_Type",0,null,{"$f":"\"<\" & A990 & \">\" & TEXT(B990,0) & \"</\" & A990 & \">\"","v":"<ML_Type>0</ML_Type>"},"Yes","<ML_Type>0</ML_Type>"]
["IML_Flag",0,null,{"$f":"\"<\" & A991 & \">\" & TEXT(B991,0) & \"</\" & A991 & \">\"","v":"<IML_Flag>0</IML_Flag>"},"Yes","<IML_Flag>0</IML_Flag>"]
["Profile_Tan_Str_1",0.25,null,{"$f":"\"<\" & A992 & \">\" & TEXT(B992,\"0.000000\") & \"</\" & A992 & \">\"","v":"<Profile_Tan_Str_1>0.250000</Profile_Tan_Str_1>"},"Yes","<Profile_Tan_Str_1>0.250000</Profile_Tan_Str_1>"]
["Profile_Tan_Str_2",0.25,null,{"$f":"\"<\" & A993 & \">\" & TEXT(B993,\"0.000000\") & \"</\" & A993 & \">\"","v":"<Profile_Tan_Str_2>0.250000</Profile_Tan_Str_2>"},"Yes","<Profile_Tan_Str_2>0.250000</Profile_Tan_Str_2>"]
["Profile_Tan_Ang",0,null,{"$f":"\"<\" & A994 & \">\" & TEXT(B994,\"0.000000\") & \"</\" & A994 & \">\"","v":"<Profile_Tan_Ang>0.000000</Profile_Tan_Ang>"},"Yes","<Profile_Tan_Ang>0.000000</Profile_Tan_Ang>"]
["Num_Sect_Interp_1",0,null,{"$f":"\"<\" & A995 & \">\" & TEXT(B995,0) & \"</\" & A995 & \">\"","v":"<Num_Sect_Interp_1>0</Num_Sect_Interp_1>"},"Yes","<Num_Sect_Interp_1>0</Num_Sect_Interp_1>"]
["Num_Sect_Interp_2",0,null,{"$f":"\"<\" & A996 & \">\" & TEXT(B996,0) & \"</\" & A996 & \">\"","v":"<Num_Sect_Interp_2>0</Num_Sect_Interp_2>"},"Yes","<Num_Sect_Interp_2>0</Num_Sect_Interp_2>"]
["OML_Parms",null,null,{"$f":"\"<\" & A997 & \">\"","v":"<OML_Parms>"},"Yes","<OML_Parms>"]
["Type",1,null,{"$f":"\"<\" & A998 & \">\" & TEXT(B998,0) & \"</\" & A998 & \">\"","v":"<Type>1</Type>"},"Yes","<Type>1</Type>"]
["Height",{"$f":"Input!$D$69","v":5.8310000000000004},null,{"$f":"\"<\" & A999 & \">\" & TEXT(B999,\"0.000000\") & \"</\" & A999 & \">\"","v":"<Height>5.831000</Height>"},"No","<Height>3.960000</Height>"]
["Width",{"$f":"B999","v":5.8310000000000004},null,"<Width>5.831000</Width>","No","<Width>3.960000</Width>"]
["Max_Width_Location",0,null,"<Max_Width_Location>0.000000</Max_Width_Location>","Yes","<Max_Width_Location>0.000000</Max_Width_Location>"]
["Corner_Radius",0.5,null,"<Corner_Radius>0.500000</Corner_Radius>","Yes","<Corner_Radius>0.500000</Corner_Radius>"]
["Top_Tan_Angle",90,null,"<Top_Tan_Angle>90.000000</Top_Tan_Angle>","Yes","<Top_Tan_Angle>90.000000</Top_Tan_Angle>"]
["Bot_Tan_Angle",90,null,"<Bot_Tan_Angle>90.000000</Bot_Tan_Angle>","Yes","<Bot_Tan_Angle>90.000000</Bot_Tan_Angle>"]
["Top_Tan_Strength",0.83,null,"<Top_Tan_Strength>0.830000</Top_Tan_Strength>","Yes","<Top_Tan_Strength>0.830000</Top_Tan_Strength>"]
["Upper_Tan_Strength",0.83,null,"<Upper_Tan_Strength>0.830000</Upper_Tan_Strength>","Yes","<Upper_Tan_Strength>0.830000</Upper_Tan_Strength>"]
["Lower_Tan_Strength",0.83,null,"<Lower_Tan_Strength>0.830000</Lower_Tan_Strength>","Yes","<Lower_Tan_Strength>0.830000</Lower_Tan_Strength>"]
["Bottom_Tan_Strength",0.83,null,"<Bottom_Tan_Strength>0.830000</Bottom_Tan_Strength>","Yes","<Bottom_Tan_Strength>0.830000</Bottom_Tan_Strength>"]
["/OML_Parms",null,null,{"$f":"\"<\" & A1009 & \">\"","v":"</OML_Parms>"},"Yes","</OML_Parms>"]
["IML_Parms",null,null,{"$f":"\"<\" & A1010 & \">\"","v":"<IML_Parms>"},"Yes","<IML_Parms>"]
["Type",2,null,{"$f":"\"<\" & A1011 & \">\" & TEXT(B1011,0) & \"</\" & A1011 & \">\"","v":"<Type>2</Type>"},"Yes","<Type>2</Type>"]
["Height",3,null,{"$f":"\"<\" & A1012 & \">\" & TEXT(B1012,\"0.000000\") & \"</\" & A1012 & \">\"","v":"<Height>3.000000</Height>"},"Yes","<Height>3.000000</Height>"]
["Width",2.5,null,"<Width>2.500000</Width>","Yes","<Width>2.500000</Width>"]
["Max_Width_Location",0,null,"<Max_Width_Location>0.000000</Max_Width_Location>","Yes","<Max_Width_Location>0.000000</Max_Width_Location>"]
["Corner_Radius",0.5,null,"<Corner_Radius>0.500000</Corner_Radius>","Yes","<Corner_Radius>0.500000</Corner_Radius>"]
["Top_Tan_Angle",90,null,"<Top_Tan_Angle>90.000000</Top_Tan_Angle>","Yes","<Top_Tan_Angle>90.000000</Top_Tan_Angle>"]
["Bot_Tan_Angle",90,null,"<Bot_Tan_Angle>90.000000</Bot_Tan_Angle>",{"$f":"IF(D1017=F1017,\"Yes\",\"No\")","v":"Yes"},"<Bot_Tan_Angle>90.000000</Bot_Tan_Angle>"]
["Top_Tan_Strength",0.83,null,"<Top_Tan_Strength>0.830000</Top_Tan_Strength>","Yes","<Top_Tan_Strength>0.830000</Top_Tan_Strength>"]
["Upper_Tan_Strength",0.83,null,"<Upper_Tan_Strength>0.830000</Upper_Tan_Strength>","Yes","<Upper_Tan_Strength>0.830000</Upper_Tan_Strength>"]
["Lower_Tan_Strength",0.83,null,"<Lower_Tan_Strength>0.830000</Lower_Tan_Strength>","Yes","<Lower_Tan_Strength>0.830000</Lower_Tan_Strength>"]
["Bottom_Tan_Strength",0.83,null,"<Bottom_Tan_Strength>0.830000</Bottom_Tan_Strength>","Yes","<Bottom_Tan_Strength>0.830000</Bottom_Tan_Strength>"]
["/IML_Parms",null,null,{"$f":"\"<\" & A1022 & \">\"","v":"</IML_Parms>"},"Yes","</IML_Parms>"]
["/Cross_Section",null,null,{"$f":"\"<\" & A1023 & \">\"","v":"</Cross_Section>"},"Yes","</Cross_Section>"]
["Cross_Section","CrossSection6",null,{"$f":"\"<\" & A1024 & \">\"","v":"<Cross_Section>"},"Yes","<Cross_Section>"]
["Num_Pnts",45,null,{"$f":"\"<\" & A1025 & \">\" & TEXT(B1025,0) & \"</\" & A1025 & \">\"","v":"<Num_Pnts>45</Num_Pnts>"},"Yes","<Num_Pnts>45</Num_Pnts>"]
["Spine_Location",{"$f":"(l_F-l_aft.F)/l_F","v":0.67},null,{"$f":"\"<\" & A1026 & \">\" & TEXT(B1026,\"0.000000\") & \"</\" & A1026 & \">\"","v":"<Spine_Location>0.670000</Spine_Location>"},"No","<Spine_Location>0.634972</Spine_Location>"]
["Z_Offset",0,null,"<Z_Offset>0.000000</Z_Offset>","Yes","<Z_Offset>0.000000</Z_Offset>"]
["Top_Thick",0.5,null,"<Top_Thick>0.500000</Top_Thick>","Yes","<Top_Thick>0.500000</Top_Thick>"]
["Bot_Thick",0.5,null,"<Bot_Thick>0.500000</Bot_Thick>","Yes","<Bot_Thick>0.500000</Bot_Thick>"]
["Side_Thick",0.5,null,"<Side_Thick>0.500000</Side_Thick>","Yes","<Side_Thick>0.500000</Side_Thick>"]
["Act_Top_Thick",0.5,null,"<Act_Top_Thick>0.500000</Act_Top_Thick>","Yes","<Act_Top_Thick>0.500000</Act_Top_Thick>"]
["Act_Bot_Thick",0.5,null,"<Act_Bot_Thick>0.500000</Act_Bot_Thick>","Yes","<Act_Bot_Thick>0.500000</Act_Bot_Thick>"]
["Act_Side_Thick",0.5,null,"<Act_Side_Thick>0.500000</Act_Side_Thick>","Yes","<Act_Side_Thick>0.500000</Act_Side_Thick>"]
["IML_X_Offset",0,null,"<IML_X_Offset>0.000000</IML_X_Offset>","Yes","<IML_X_Offset>0.000000</IML_X_Offset>"]
["IML_Z_Offset",0,null,"<IML_Z_Offset>0.000000</IML_Z_Offset>","Yes","<IML_Z_Offset>0.000000</IML_Z_Offset>"]
["ML_Type",0,null,{"$f":"\"<\" & A1036 & \">\" & TEXT(B1036,0) & \"</\" & A1036 & \">\"","v":"<ML_Type>0</ML_Type>"},"Yes","<ML_Type>0</ML_Type>"]
["IML_Flag",0,null,{"$f":"\"<\" & A1037 & \">\" & TEXT(B1037,0) & \"</\" & A1037 & \">\"","v":"<IML_Flag>0</IML_Flag>"},"Yes","<IML_Flag>0</IML_Flag>"]
["Profile_Tan_Str_1",0.25,null,{"$f":"\"<\" & A1038 & \">\" & TEXT(B1038,\"0.000000\") & \"</\" & A1038 & \">\"","v":"<Profile_Tan_Str_1>0.250000</Profile_Tan_Str_1>"},"Yes","<Profile_Tan_Str_1>0.250000</Profile_Tan_Str_1>"]
["Profile_Tan_Str_2",0.25,null,{"$f":"\"<\" & A1039 & \">\" & TEXT(B1039,\"0.000000\") & \"</\" & A1039 & \">\"","v":"<Profile_Tan_Str_2>0.250000</Profile_Tan_Str_2>"},"Yes","<Profile_Tan_Str_2>0.250000</Profile_Tan_Str_2>"]
["Profile_Tan_Ang",0,null,{"$f":"\"<\" & A1040 & \">\" & TEXT(B1040,\"0.000000\") & \"</\" & A1040 & \">\"","v":"<Profile_Tan_Ang>0.000000</Profile_Tan_Ang>"},"Yes","<Profile_Tan_Ang>0.000000</Profile_Tan_Ang>"]
["Num_Sect_Interp_1",0,null,{"$f":"\"<\" & A1041 & \">\" & TEXT(B1041,0) & \"</\" & A1041 & \">\"","v":"<Num_Sect_Interp_1>0</Num_Sect_Interp_1>"},"Yes","<Num_Sect_Interp_1>0</Num_Sect_Interp_1>"]
["Num_Sect_Interp_2",0,null,{"$f":"\"<\" & A1042 & \">\" & TEXT(B1042,0) & \"</\" & A1042 & \">\"","v":"<Num_Sect_Interp_2>0</Num_Sect_Interp_2>"},"Yes","<Num_Sect_Interp_2>0</Num_Sect_Interp_2>"]
["OML_Parms",null,null,{"$f":"\"<\" & A1043 & \">\"","v":"<OML_Parms>"},"Yes","<OML_Parms>"]
["Type",1,null,{"$f":"\"<\" & A1044 & \">\" & TEXT(B1044,0) & \"</\" & A1044 & \">\"","v":"<Type>1</Type>"},"Yes","<Type>1</Type>"]
["Height",{"$f":"Input!$D$69","v":5.8310000000000004},null,{"$f":"\"<\" & A1045 & \">\" & TEXT(B1045,\"0.000000\") & \"</\" & A1045 & \">\"","v":"<Height>5.831000</Height>"},"No","<Height>3.960000</Height>"]
["Width",{"$f":"B1045","v":5.8310000000000004},null,"<Width>5.831000</Width>","No","<Width>3.960000</Width>"]
["Max_Width_Location",0,null,"<Max_Width_Location>0.000000</Max_Width_Location>","Yes","<Max_Width_Location>0.000000</Max_Width_Location>"]
["Corner_Radius",0.5,null,"<Corner_Radius>0.500000</Corner_Radius>","Yes","<Corner_Radius>0.500000</Corner_Radius>"]
["Top_Tan_Angle",90,null,"<Top_Tan_Angle>90.000000</Top_Tan_Angle>","Yes","<Top_Tan_Angle>90.000000</Top_Tan_Angle>"]
["Bot_Tan_Angle",90,null,"<Bot_Tan_Angle>90.000000</Bot_Tan_Angle>","Yes","<Bot_Tan_Angle>90.000000</Bot_Tan_Angle>"]
["Top_Tan_Strength",0.83,null,"<Top_Tan_Strength>0.830000</Top_Tan_Strength>","Yes","<Top_Tan_Strength>0.830000</Top_Tan_Strength>"]
["Upper_Tan_Strength",0.83,null,"<Upper_Tan_Strength>0.830000</Upper_Tan_Strength>","Yes","<Upper_Tan_Strength>0.830000</Upper_Tan_Strength>"]
["Lower_Tan_Strength",0.83,null,"<Lower_Tan_Strength>0.830000</Lower_Tan_Strength>","Yes","<Lower_Tan_Strength>0.830000</Lower_Tan_Strength>"]
["Bottom_Tan_Strength",0.83,null,"<Bottom_Tan_Strength>0.830000</Bottom_Tan_Strength>","Yes","<Bottom_Tan_Strength>0.830000</Bottom_Tan_Strength>"]
["/OML_Parms",null,null,{"$f":"\"<\" & A1055 & \">\"","v":"</OML_Parms>"},"Yes","</OML_Parms>"]
["IML_Parms",null,null,{"$f":"\"<\" & A1056 & \">\"","v":"<IML_Parms>"},"Yes","<IML_Parms>"]
["Type",2,null,{"$f":"\"<\" & A1057 & \">\" & TEXT(B1057,0) & \"</\" & A1057 & \">\"","v":"<Type>2</Type>"},"Yes","<Type>2</Type>"]
["Height",3,null,{"$f":"\"<\" & A1058 & \">\" & TEXT(B1058,\"0.000000\") & \"</\" & A1058 & \">\"","v":"<Height>3.000000</Height>"},"Yes","<Height>3.000000</Height>"]
["Width",2.5,null,"<Width>2.500000</Width>","Yes","<Width>2.500000</Width>"]
["Max_Width_Location",0,null,"<Max_Width_Location>0.000000</Max_Width_Location>","Yes","<Max_Width_Location>0.000000</Max_Width_Location>"]
["Corner_Radius",0.5,null,"<Corner_Radius>0.500000</Corner_Radius>","Yes","<Corner_Radius>0.500000</Corner_Radius>"]
["Top_Tan_Angle",90,null,"<Top_Tan_Angle>90.000000</Top_Tan_Angle>","Yes","<Top_Tan_Angle>90.000000</Top_Tan_Angle>"]
["Bot_Tan_Angle",90,null,"<Bot_Tan_Angle>90.000000</Bot_Tan_Angle>","Yes","<Bot_Tan_Angle>90.000000</Bot_Tan_Angle>"]
["Top_Tan_Strength",0.83,null,"<Top_Tan_Strength>0.830000</Top_Tan_Strength>","Yes","<Top_Tan_Strength>0.830000</Top_Tan_Strength>"]
["Upper_Tan_Strength",0.83,null,"<Upper_Tan_Strength>0.830000</Upper_Tan_Strength>","Yes","<Upper_Tan_Strength>0.830000</Upper_Tan_Strength>"]
["Lower_Tan_Strength",0.83,null,"<Lower_Tan_Strength>0.830000</Lower_Tan_Strength>","Yes","<Lower_Tan_Strength>0.830000</Lower_Tan_Strength>"]
["Bottom_Tan_Strength",0.83,null,"<Bottom_Tan_Strength>0.830000</Bottom_Tan_Strength>","Yes","<Bottom_Tan_Strength>0.830000</Bottom_Tan_Strength>"]
["/IML_Parms",null,null,{"$f":"\"<\" & A1068 & \">\"","v":"</IML_Parms>"},"Yes","</IML_Parms>"]
["/Cross_Section",null,null,{"$f":"\"<\" & A1069 & \">\"","v":"</Cross_Section>"},"Yes","</Cross_Section>"]
["Cross_Section","CrossSection7",null,{"$f":"\"<\" & A1070 & \">\"","v":"<Cross_Section>"},"Yes","<Cross_Section>"]
["Num_Pnts",45,null,{"$f":"\"<\" & A1071 & \">\" & TEXT(B1071,0) & \"</\" & A1071 & \">\"","v":"<Num_Pnts>45</Num_Pnts>"},"Yes","<Num_Pnts>45</Num_Pnts>"]
["Spine_Location",{"$f":"B1026 + (1-B1026)/2","v":0.83499999999999996},null,{"$f":"\"<\" & A1072 & \">\" & TEXT(B1072,\"0.000000\") & \"</\" & A1072 & \">\"","v":"<Spine_Location>0.835000</Spine_Location>"},"No","<Spine_Location>0.817486</Spine_Location>"]
["Z_Offset",{"$f":"(d_F-B1091)/2","v":0.66181849999999987},null,"<Z_Offset>0.661819</Z_Offset>","No","<Z_Offset>0.449460</Z_Offset>"]
["Top_Thick",0.5,null,"<Top_Thick>0.500000</Top_Thick>","Yes","<Top_Thick>0.500000</Top_Thick>"]
["Bot_Thick",0.5,null,"<Bot_Thick>0.500000</Bot_Thick>","Yes","<Bot_Thick>0.500000</Bot_Thick>"]
["Side_Thick",0.5,null,"<Side_Thick>0.500000</Side_Thick>","Yes","<Side_Thick>0.500000</Side_Thick>"]
["Act_Top_Thick",0.5,null,"<Act_Top_Thick>0.500000</Act_Top_Thick>","Yes","<Act_Top_Thick>0.500000</Act_Top_Thick>"]
["Act_Bot_Thick",0.5,null,"<Act_Bot_Thick>0.500000</Act_Bot_Thick>","Yes","<Act_Bot_Thick>0.500000</Act_Bot_Thick>"]
["Act_Side_Thick",0.5,null,"<Act_Side_Thick>0.500000</Act_Side_Thick>","Yes","<Act_Side_Thick>0.500000</Act_Side_Thick>"]
["IML_X_Offset",0,null,"<IML_X_Offset>0.000000</IML_X_Offset>","Yes","<IML_X_Offset>0.000000</IML_X_Offset>"]
["IML_Z_Offset",0,null,"<IML_Z_Offset>0.000000</IML_Z_Offset>",{"$f":"IF(D1081=F1081,\"Yes\",\"No\")","v":"Yes"},"<IML_Z_Offset>0.000000</IML_Z_Offset>"]
["ML_Type",0,null,{"$f":"\"<\" & A1082 & \">\" & TEXT(B1082,0) & \"</\" & A1082 & \">\"","v":"<ML_Type>0</ML_Type>"},"Yes","<ML_Type>0</ML_Type>"]
["IML_Flag",0,null,{"$f":"\"<\" & A1083 & \">\" & TEXT(B1083,0) & \"</\" & A1083 & \">\"","v":"<IML_Flag>0</IML_Flag>"},"Yes","<IML_Flag>0</IML_Flag>"]
["Profile_Tan_Str_1",0.25,null,{"$f":"\"<\" & A1084 & \">\" & TEXT(B1084,\"0.000000\") & \"</\" & A1084 & \">\"","v":"<Profile_Tan_Str_1>0.250000</Profile_Tan_Str_1>"},"Yes","<Profile_Tan_Str_1>0.250000</Profile_Tan_Str_1>"]
["Profile_Tan_Str_2",0.25,null,{"$f":"\"<\" & A1085 & \">\" & TEXT(B1085,\"0.000000\") & \"</\" & A1085 & \">\"","v":"<Profile_Tan_Str_2>0.250000</Profile_Tan_Str_2>"},"Yes","<Profile_Tan_Str_2>0.250000</Profile_Tan_Str_2>"]
["Profile_Tan_Ang",0,null,{"$f":"\"<\" & A1086 & \">\" & TEXT(B1086,\"0.000000\") & \"</\" & A1086 & \">\"","v":"<Profile_Tan_Ang>0.000000</Profile_Tan_Ang>"},"Yes","<Profile_Tan_Ang>0.000000</Profile_Tan_Ang>"]
["Num_Sect_Interp_1",0,null,{"$f":"\"<\" & A1087 & \">\" & TEXT(B1087,0) & \"</\" & A1087 & \">\"","v":"<Num_Sect_Interp_1>0</Num_Sect_Interp_1>"},"Yes","<Num_Sect_Interp_1>0</Num_Sect_Interp_1>"]
["Num_Sect_Interp_2",0,null,{"$f":"\"<\" & A1088 & \">\" & TEXT(B1088,0) & \"</\" & A1088 & \">\"","v":"<Num_Sect_Interp_2>0</Num_Sect_Interp_2>"},"Yes","<Num_Sect_Interp_2>0</Num_Sect_Interp_2>"]
["OML_Parms",null,null,{"$f":"\"<\" & A1089 & \">\"","v":"<OML_Parms>"},"Yes","<OML_Parms>"]
["Type",1,null,{"$f":"\"<\" & A1090 & \">\" & TEXT(B1090,0) & \"</\" & A1090 & \">\"","v":"<Type>1</Type>"},"Yes","<Type>1</Type>"]
["Height",{"$f":"0.773*B1045","v":4.5073630000000007},null,{"$f":"\"<\" & A1091 & \">\" & TEXT(B1091,\"0.000000\") & \"</\" & A1091 & \">\"","v":"<Height>4.507363</Height>"},"No","<Height>3.061080</Height>"]
["Width",{"$f":"B1091","v":4.5073630000000007},null,"<Width>4.507363</Width>","No","<Width>3.061080</Width>"]
["Max_Width_Location",0,null,"<Max_Width_Location>0.000000</Max_Width_Location>","Yes","<Max_Width_Location>0.000000</Max_Width_Location>"]
["Corner_Radius",0.5,null,"<Corner_Radius>0.500000</Corner_Radius>","Yes","<Corner_Radius>0.500000</Corner_Radius>"]
["Top_Tan_Angle",90,null,"<Top_Tan_Angle>90.000000</Top_Tan_Angle>","Yes","<Top_Tan_Angle>90.000000</Top_Tan_Angle>"]
["Bot_Tan_Angle",90,null,"<Bot_Tan_Angle>90.000000</Bot_Tan_Angle>","Yes","<Bot_Tan_Angle>90.000000</Bot_Tan_Angle>"]
["Top_Tan_Strength",0.83,null,"<Top_Tan_Strength>0.830000</Top_Tan_Strength>","Yes","<Top_Tan_Strength>0.830000</Top_Tan_Strength>"]
["Upper_Tan_Strength",0.83,null,"<Upper_Tan_Strength>0.830000</Upper_Tan_Strength>","Yes","<Upper_Tan_Strength>0.830000</Upper_Tan_Strength>"]
["Lower_Tan_Strength",0.83,null,"<Lower_Tan_Strength>0.830000</Lower_Tan_Strength>","Yes","<Lower_Tan_Strength>0.830000</Lower_Tan_Strength>"]
["Bottom_Tan_Strength",0.83,null,"<Bottom_Tan_Strength>0.830000</Bottom_Tan_Strength>","Yes","<Bottom_Tan_Strength>0.830000</Bottom_Tan_Strength>"]
["/OML_Parms",null,null,{"$f":"\"<\" & A1101 & \">\"","v":"</OML_Parms>"},"Yes","</OML_Parms>"]
["IML_Parms",null,null,{"$f":"\"<\" & A1102 & \">\"","v":"<IML_Parms>"},"Yes","<IML_Parms>"]
["Type",2,null,{"$f":"\"<\" & A1103 & \">\" & TEXT(B1103,0) & \"</\" & A1103 & \">\"","v":"<Type>2</Type>"},"Yes","<Type>2</Type>"]
["Height",3,null,{"$f":"\"<\" & A1104 & \">\" & TEXT(B1104,\"0.000000\") & \"</\" & A1104 & \">\"","v":"<Height>3.000000</Height>"},"Yes","<Height>3.000000</Height>"]
["Width",2.5,null,"<Width>2.500000</Width>","Yes","<Width>2.500000</Width>"]
["Max_Width_Location",0,null,"<Max_Width_Location>0.000000</Max_Width_Location>","Yes","<Max_Width_Location>0.000000</Max_Width_Location>"]
["Corner_Radius",0.5,null,"<Corner_Radius>0.500000</Corner_Radius>","Yes","<Corner_Radius>0.500000</Corner_Radius>"]
["Top_Tan_Angle",90,null,"<Top_Tan_Angle>90.000000</Top_Tan_Angle>","Yes","<Top_Tan_Angle>90.000000</Top_Tan_Angle>"]
["Bot_Tan_Angle",90,null,"<Bot_Tan_Angle>90.000000</Bot_Tan_Angle>","Yes","<Bot_Tan_Angle>90.000000</Bot_Tan_Angle>"]
["Top_Tan_Strength",0.83,null,"<Top_Tan_Strength>0.830000</Top_Tan_Strength>","Yes","<Top_Tan_Strength>0.830000</Top_Tan_Strength>"]
["Upper_Tan_Strength",0.83,null,"<Upper_Tan_Strength>0.830000</Upper_Tan_Strength>","Yes","<Upper_Tan_Strength>0.830000</Upper_Tan_Strength>"]
["Lower_Tan_Strength",0.83,null,"<Lower_Tan_Strength>0.830000</Lower_Tan_Strength>","Yes","<Lower_Tan_Strength>0.830000</Lower_Tan_Strength>"]
["Bottom_Tan_Strength",0.83,null,"<Bottom_Tan_Strength>0.830000</Bottom_Tan_Strength>","Yes","<Bottom_Tan_Strength>0.830000</Bottom_Tan_Strength>"]
["/IML_Parms",null,null,{"$f":"\"<\" & A1114 & \">\"","v":"</IML_Parms>"},"Yes","</IML_Parms>"]
["/Cross_Section",null,null,{"$f":"\"<\" & A1115 & \">\"","v":"</Cross_Section>"},"Yes","</Cross_Section>"]
["Cross_Section","CrossSection8",null,{"$f":"\"<\" & A1116 & \">\"","v":"<Cross_Section>"},"Yes","<Cross_Section>"]
["Num_Pnts",45,null,{"$f":"\"<\" & A1117 & \">\" & TEXT(B1117,0) & \"</\" & A1117 & \">\"","v":"<Num_Pnts>45</Num_Pnts>"},"Yes","<Num_Pnts>45</Num_Pnts>"]
["Spine_Location",0.984155,null,{"$f":"\"<\" & A1118 & \">\" & TEXT(B1118,\"0.000000\") & \"</\" & A1118 & \">\"","v":"<Spine_Location>0.984155</Spine_Location>"},"Yes","<Spine_Location>0.984155</Spine_Location>"]
["Z_Offset",{"$f":"($B$1045-B1137)/2","v":1.9533849999999999},null,"<Z_Offset>1.953385</Z_Offset>","No","<Z_Offset>1.326600</Z_Offset>"]
["Top_Thick",0.5,null,"<Top_Thick>0.500000</Top_Thick>","Yes","<Top_Thick>0.500000</Top_Thick>"]
["Bot_Thick",0.5,null,"<Bot_Thick>0.500000</Bot_Thick>","Yes","<Bot_Thick>0.500000</Bot_Thick>"]
["Side_Thick",0.5,null,"<Side_Thick>0.500000</Side_Thick>","Yes","<Side_Thick>0.500000</Side_Thick>"]
["Act_Top_Thick",0.5,null,"<Act_Top_Thick>0.500000</Act_Top_Thick>","Yes","<Act_Top_Thick>0.500000</Act_Top_Thick>"]
["Act_Bot_Thick",0.5,null,"<Act_Bot_Thick>0.500000</Act_Bot_Thick>","Yes","<Act_Bot_Thick>0.500000</Act_Bot_Thick>"]
["Act_Side_Thick",0.5,null,"<Act_Side_Thick>0.500000</Act_Side_Thick>","Yes","<Act_Side_Thick>0.500000</Act_Side_Thick>"]
["IML_X_Offset",0,null,"<IML_X_Offset>0.000000</IML_X_Offset>","Yes","<IML_X_Offset>0.000000</IML_X_Offset>"]
["IML_Z_Offset",0,null,"<IML_Z_Offset>0.000000</IML_Z_Offset>","Yes","<IML_Z_Offset>0.000000</IML_Z_Offset>"]
["ML_Type",0,null,{"$f":"\"<\" & A1128 & \">\" & TEXT(B1128,0) & \"</\" & A1128 & \">\"","v":"<ML_Type>0</ML_Type>"},"Yes","<ML_Type>0</ML_Type>"]
["IML_Flag",0,null,{"$f":"\"<\" & A1129 & \">\" & TEXT(B1129,0) & \"</\" & A1129 & \">\"","v":"<IML_Flag>0</IML_Flag>"},"Yes","<IML_Flag>0</IML_Flag>"]
["Profile_Tan_Str_1",0.25,null,{"$f":"\"<\" & A1130 & \">\" & TEXT(B1130,\"0.000000\") & \"</\" & A1130 & \">\"","v":"<Profile_Tan_Str_1>0.250000</Profile_Tan_Str_1>"},"Yes","<Profile_Tan_Str_1>0.250000</Profile_Tan_Str_1>"]
["Profile_Tan_Str_2",0.25,null,{"$f":"\"<\" & A1131 & \">\" & TEXT(B1131,\"0.000000\") & \"</\" & A1131 & \">\"","v":"<Profile_Tan_Str_2>0.250000</Profile_Tan_Str_2>"},"Yes","<Profile_Tan_Str_2>0.250000</Profile_Tan_Str_2>"]
["Profile_Tan_Ang",0,null,{"$f":"\"<\" & A1132 & \">\" & TEXT(B1132,\"0.000000\") & \"</\" & A1132 & \">\"","v":"<Profile_Tan_Ang>0.000000</Profile_Tan_Ang>"},"Yes","<Profile_Tan_Ang>0.000000</Profile_Tan_Ang>"]
["Num_Sect_Interp_1",0,null,{"$f":"\"<\" & A1133 & \">\" & TEXT(B1133,0) & \"</\" & A1133 & \">\"","v":"<Num_Sect_Interp_1>0</Num_Sect_Interp_1>"},"Yes","<Num_Sect_Interp_1>0</Num_Sect_Interp_1>"]
["Num_Sect_Interp_2",6,null,{"$f":"\"<\" & A1134 & \">\" & TEXT(B1134,0) & \"</\" & A1134 & \">\"","v":"<Num_Sect_Interp_2>6</Num_Sect_Interp_2>"},"Yes","<Num_Sect_Interp_2>6</Num_Sect_Interp_2>"]
["OML_Parms",null,null,{"$f":"\"<\" & A1135 & \">\"","v":"<OML_Parms>"},"Yes","<OML_Parms>"]
["Type",1,null,{"$f":"\"<\" & A1136 & \">\" & TEXT(B1136,0) & \"</\" & A1136 & \">\"","v":"<Type>1</Type>"},"Yes","<Type>1</Type>"]
["Height",{"$f":"0.33*$B$999","v":1.9242300000000003},null,{"$f":"\"<\" & A1137 & \">\" & TEXT(B1137,\"0.000000\") & \"</\" & A1137 & \">\"","v":"<Height>1.924230</Height>"},"No","<Height>1.306800</Height>"]
["Width",{"$f":"B1137","v":1.9242300000000003},null,"<Width>1.924230</Width>","No","<Width>1.306800</Width>"]
["Max_Width_Location",0,null,"<Max_Width_Location>0.000000</Max_Width_Location>","Yes","<Max_Width_Location>0.000000</Max_Width_Location>"]
["Corner_Radius",0.5,null,"<Corner_Radius>0.500000</Corner_Radius>","Yes","<Corner_Radius>0.500000</Corner_Radius>"]
["Top_Tan_Angle",90,null,"<Top_Tan_Angle>90.000000</Top_Tan_Angle>","Yes","<Top_Tan_Angle>90.000000</Top_Tan_Angle>"]
["Bot_Tan_Angle",90,null,"<Bot_Tan_Angle>90.000000</Bot_Tan_Angle>","Yes","<Bot_Tan_Angle>90.000000</Bot_Tan_Angle>"]
["Top_Tan_Strength",0.83,null,"<Top_Tan_Strength>0.830000</Top_Tan_Strength>","Yes","<Top_Tan_Strength>0.830000</Top_Tan_Strength>"]
["Upper_Tan_Strength",0.83,null,"<Upper_Tan_Strength>0.830000</Upper_Tan_Strength>","Yes","<Upper_Tan_Strength>0.830000</Upper_Tan_Strength>"]
["Lower_Tan_Strength",0.83,null,"<Lower_Tan_Strength>0.830000</Lower_Tan_Strength>",{"$f":"IF(D1145=F1145,\"Yes\",\"No\")","v":"Yes"},"<Lower_Tan_Strength>0.830000</Lower_Tan_Strength>"]
["Bottom_Tan_Strength",0.83,null,"<Bottom_Tan_Strength>0.830000</Bottom_Tan_Strength>","Yes","<Bottom_Tan_Strength>0.830000</Bottom_Tan_Strength>"]
["/OML_Parms",null,null,{"$f":"\"<\" & A1147 & \">\"","v":"</OML_Parms>"},"Yes","</OML_Parms>"]
["IML_Parms",null,null,{"$f":"\"<\" & A1148 & \">\"","v":"<IML_Parms>"},"Yes","<IML_Parms>"]
["Type",2,null,{"$f":"\"<\" & A1149 & \">\" & TEXT(B1149,0) & \"</\" & A1149 & \">\"","v":"<Type>2</Type>"},"Yes","<Type>2</Type>"]
["Height",3,null,{"$f":"\"<\" & A1150 & \">\" & TEXT(B1150,\"0.000000\") & \"</\" & A1150 & \">\"","v":"<Height>3.000000</Height>"},"Yes","<Height>3.000000</Height>"]
["Width",2.5,null,"<Width>2.500000</Width>","Yes","<Width>2.500000</Width>"]
["Max_Width_Location",0,null,"<Max_Width_Location>0.000000</Max_Width_Location>","Yes","<Max_Width_Location>0.000000</Max_Width_Location>"]
["Corner_Radius",0.5,null,"<Corner_Radius>0.500000</Corner_Radius>","Yes","<Corner_Radius>0.500000</Corner_Radius>"]
["Top_Tan_Angle",90,null,"<Top_Tan_Angle>90.000000</Top_Tan_Angle>","Yes","<Top_Tan_Angle>90.000000</Top_Tan_Angle>"]
["Bot_Tan_Angle",90,null,"<Bot_Tan_Angle>90.000000</Bot_Tan_Angle>","Yes","<Bot_Tan_Angle>90.000000</Bot_Tan_Angle>"]
["Top_Tan_Strength",0.83,null,"<Top_Tan_Strength>0.830000</Top_Tan_Strength>","Yes","<Top_Tan_Strength>0.830000</Top_Tan_Strength>"]
["Upper_Tan_Strength",0.83,null,"<Upper_Tan_Strength>0.830000</Upper_Tan_Strength>","Yes","<Upper_Tan_Strength>0.830000</Upper_Tan_Strength>"]
["Lower_Tan_Strength",0.83,null,"<Lower_Tan_Strength>0.830000</Lower_Tan_Strength>","Yes","<Lower_Tan_Strength>0.830000</Lower_Tan_Strength>"]
["Bottom_Tan_Strength",0.83,null,"<Bottom_Tan_Strength>0.830000</Bottom_Tan_Strength>","Yes","<Bottom_Tan_Strength>0.830000</Bottom_Tan_Strength>"]
["/IML_Parms",null,null,{"$f":"\"<\" & A1160 & \">\"","v":"</IML_Parms>"},"Yes","</IML_Parms>"]
["/Cross_Section",null,null,{"$f":"\"<\" & A1161 & \">\"","v":"</Cross_Section>"},"Yes","</Cross_Section>"]
["Cross_Section","CrossSection9",null,{"$f":"\"<\" & A1162 & \">\"","v":"<Cross_Section>"},"Yes","<Cross_Section>"]
["Num_Pnts",45,null,{"$f":"\"<\" & A1163 & \">\" & TEXT(B1163,0) & \"</\" & A1163 & \">\"","v":"<Num_Pnts>45</Num_Pnts>"},"Yes","<Num_Pnts>45</Num_Pnts>"]
["Spine_Location",1,null,{"$f":"\"<\" & A1164 & \">\" & TEXT(B1164,\"0.000000\") & \"</\" & A1164 & \">\"","v":"<Spine_Location>1.000000</Spine_Location>"},"Yes","<Spine_Location>1.000000</Spine_Location>"]
["Z_Offset",{"$f":"B1119","v":1.9533849999999999},null,"<Z_Offset>1.953385</Z_Offset>","No","<Z_Offset>1.326600</Z_Offset>"]
["Top_Thick",0.5,null,"<Top_Thick>0.500000</Top_Thick>","Yes","<Top_Thick>0.500000</Top_Thick>"]
["Bot_Thick",0.5,null,"<Bot_Thick>0.500000</Bot_Thick>","Yes","<Bot_Thick>0.500000</Bot_Thick>"]
["Side_Thick",0.5,null,"<Side_Thick>0.500000</Side_Thick>","Yes","<Side_Thick>0.500000</Side_Thick>"]
["Act_Top_Thick",0.5,null,"<Act_Top_Thick>0.500000</Act_Top_Thick>","Yes","<Act_Top_Thick>0.500000</Act_Top_Thick>"]
["Act_Bot_Thick",0.5,null,"<Act_Bot_Thick>0.500000</Act_Bot_Thick>","Yes","<Act_Bot_Thick>0.500000</Act_Bot_Thick>"]
["Act_Side_Thick",0.5,null,"<Act_Side_Thick>0.500000</Act_Side_Thick>","Yes","<Act_Side_Thick>0.500000</Act_Side_Thick>"]
["IML_X_Offset",0,null,"<IML_X_Offset>0.000000</IML_X_Offset>","Yes","<IML_X_Offset>0.000000</IML_X_Offset>"]
["IML_Z_Offset",0,null,"<IML_Z_Offset>0.000000</IML_Z_Offset>","Yes","<IML_Z_Offset>0.000000</IML_Z_Offset>"]
["ML_Type",0,null,{"$f":"\"<\" & A1174 & \">\" & TEXT(B1174,0) & \"</\" & A1174 & \">\"","v":"<ML_Type>0</ML_Type>"},"Yes","<ML_Type>0</ML_Type>"]
["IML_Flag",0,null,{"$f":"\"<\" & A1175 & \">\" & TEXT(B1175,0) & \"</\" & A1175 & \">\"","v":"<IML_Flag>0</IML_Flag>"},"Yes","<IML_Flag>0</IML_Flag>"]
["Profile_Tan_Str_1",0.25,null,{"$f":"\"<\" & A1176 & \">\" & TEXT(B1176,\"0.000000\") & \"</\" & A1176 & \">\"","v":"<Profile_Tan_Str_1>0.250000</Profile_Tan_Str_1>"},"Yes","<Profile_Tan_Str_1>0.250000</Profile_Tan_Str_1>"]
["Profile_Tan_Str_2",0.25,null,{"$f":"\"<\" & A1177 & \">\" & TEXT(B1177,\"0.000000\") & \"</\" & A1177 & \">\"","v":"<Profile_Tan_Str_2>0.250000</Profile_Tan_Str_2>"},"Yes","<Profile_Tan_Str_2>0.250000</Profile_Tan_Str_2>"]
["Profile_Tan_Ang",0,null,{"$f":"\"<\" & A1178 & \">\" & TEXT(B1178,\"0.000000\") & \"</\" & A1178 & \">\"","v":"<Profile_Tan_Ang>0.000000</Profile_Tan_Ang>"},"Yes","<Profile_Tan_Ang>0.000000</Profile_Tan_Ang>"]
["Num_Sect_Interp_1",6,null,{"$f":"\"<\" & A1179 & \">\" & TEXT(B1179,0) & \"</\" & A1179 & \">\"","v":"<Num_Sect_Interp_1>6</Num_Sect_Interp_1>"},"Yes","<Num_Sect_Interp_1>6</Num_Sect_Interp_1>"]
["Num_Sect_Interp_2",0,null,{"$f":"\"<\" & A1180 & \">\" & TEXT(B1180,0) & \"</\" & A1180 & \">\"","v":"<Num_Sect_Interp_2>0</Num_Sect_Interp_2>"},"Yes","<Num_Sect_Interp_2>0</Num_Sect_Interp_2>"]
["OML_Parms",null,null,{"$f":"\"<\" & A1181 & \">\"","v":"<OML_Parms>"},"Yes","<OML_Parms>"]
["Type",1,null,{"$f":"\"<\" & A1182 & \">\" & TEXT(B1182,0) & \"</\" & A1182 & \">\"","v":"<Type>1</Type>"},"Yes","<Type>1</Type>"]
["Height",0,null,{"$f":"\"<\" & A1183 & \">\" & TEXT(B1183,\"0.000000\") & \"</\" & A1183 & \">\"","v":"<Height>0.000000</Height>"},"Yes","<Height>0.000000</Height>"]
["Width",{"$f":"B1183","v":0},null,"<Width>0.000000</Width>","Yes","<Width>0.000000</Width>"]
["Max_Width_Location",0,null,"<Max_Width_Location>0.000000</Max_Width_Location>","Yes","<Max_Width_Location>0.000000</Max_Width_Location>"]
["Corner_Radius",0.5,null,"<Corner_Radius>0.500000</Corner_Radius>","Yes","<Corner_Radius>0.500000</Corner_Radius>"]
["Top_Tan_Angle",90,null,"<Top_Tan_Angle>90.000000</Top_Tan_Angle>","Yes","<Top_Tan_Angle>90.000000</Top_Tan_Angle>"]
["Bot_Tan_Angle",90,null,"<Bot_Tan_Angle>90.000000</Bot_Tan_Angle>","Yes","<Bot_Tan_Angle>90.000000</Bot_Tan_Angle>"]
["Top_Tan_Strength",0.83,null,"<Top_Tan_Strength>0.830000</Top_Tan_Strength>","Yes","<Top_Tan_Strength>0.830000</Top_Tan_Strength>"]
["Upper_Tan_Strength",0.83,null,"<Upper_Tan_Strength>0.830000</Upper_Tan_Strength>","Yes","<Upper_Tan_Strength>0.830000</Upper_Tan_Strength>"]
["Lower_Tan_Strength",0.83,null,"<Lower_Tan_Strength>0.830000</Lower_Tan_Strength>","Yes","<Lower_Tan_Strength>0.830000</Lower_Tan_Strength>"]
["Bottom_Tan_Strength",0.83,null,"<Bottom_Tan_Strength>0.830000</Bottom_Tan_Strength>","Yes","<Bottom_Tan_Strength>0.830000</Bottom_Tan_Strength>"]
["/OML_Parms",null,null,{"$f":"\"<\" & A1193 & \">\"","v":"</OML_Parms>"},"Yes","</OML_Parms>"]
["IML_Parms",null,null,{"$f":"\"<\" & A1194 & \">\"","v":"<IML_Parms>"},"Yes","<IML_Parms>"]
["Type",2,null,{"$f":"\"<\" & A1195 & \">\" & TEXT(B1195,0) & \"</\" & A1195 & \">\"","v":"<Type>2</Type>"},"Yes","<Type>2</Type>"]
["Height",3,null,{"$f":"\"<\" & A1196 & \">\" & TEXT(B1196,\"0.000000\") & \"</\" & A1196 & \">\"","v":"<Height>3.000000</Height>"},"Yes","<Height>3.000000</Height>"]
["Width",2.5,null,"<Width>2.500000</Width>","Yes","<Width>2.500000</Width>"]
["Max_Width_Location",0,null,"<Max_Width_Location>0.000000</Max_Width_Location>","Yes","<Max_Width_Location>0.000000</Max_Width_Location>"]
["Corner_Radius",0.5,null,"<Corner_Radius>0.500000</Corner_Radius>","Yes","<Corner_Radius>0.500000</Corner_Radius>"]
["Top_Tan_Angle",90,null,"<Top_Tan_Angle>90.000000</Top_Tan_Angle>","Yes","<Top_Tan_Angle>90.000000</Top_Tan_Angle>"]
["Bot_Tan_Angle",90,null,"<Bot_Tan_Angle>90.000000</Bot_Tan_Angle>","Yes","<Bot_Tan_Angle>90.000000</Bot_Tan_Angle>"]
["Top_Tan_Strength",0.83,null,"<Top_Tan_Strength>0.830000</Top_Tan_Strength>","Yes","<Top_Tan_Strength>0.830000</Top_Tan_Strength>"]
["Upper_Tan_Strength",0.83,null,"<Upper_Tan_Strength>0.830000</Upper_Tan_Strength>","Yes","<Upper_Tan_Strength>0.830000</Upper_Tan_Strength>"]
["Lower_Tan_Strength",0.83,null,"<Lower_Tan_Strength>0.830000</Lower_Tan_Strength>","Yes","<Lower_Tan_Strength>0.830000</Lower_Tan_Strength>"]
["Bottom_Tan_Strength",0.83,null,"<Bottom_Tan_Strength>0.830000</Bottom_Tan_Strength>","Yes","<Bottom_Tan_Strength>0.830000</Bottom_Tan_Strength>"]
["/IML_Parms",null,null,{"$f":"\"<\" & A1206 & \">\"","v":"</IML_Parms>"},"Yes","</IML_Parms>"]
["/Cross_Section",null,null,{"$f":"\"<\" & A1207 & \">\"","v":"</Cross_Section>"},"Yes","</Cross_Section>"]
["/Cross_Section_List",null,null,{"$f":"\"<\" & A1208 & \">\"","v":"</Cross_Section_List>"},"Yes","</Cross_Section_List>"]
["/Component",null,{"$f":"C683","v":"Yes"},{"$f":"IF(C1209=\"Yes\",(\"<\"&A1209&\">\"),(\"<\"&A1209&\"-->\"))","v":"</Component>"},{"$f":"IF(D1209=F1209,\"Yes\",\"No\")","v":"Yes"},"</Component>"]
["Component",{"$f":"B1213 & \" (Model)\"","v":"Engine 2 (Model)"},{"$f":"IF(Input!$D$27>=1,\"Yes\",\"No\")","v":"Yes"},{"$f":"IF(C1210=\"Yes\",(\"<\"&A1210&\">\"),(\"<!--\"&A1210&\">\"))","v":"<Component>"},null,"<Component>"]
["Type","Blank",null,{"$f":"\"<\" & A1211 & \">\" & TEXT(B1211,0) & \"</\" & A1211 & \">\"","v":"<Type>Blank</Type>"},null,"<Type>Blank</Type>"]
["General_Parms",null,null,{"$f":"\"<\" & A1212 & \">\"","v":"<General_Parms>"},null,"<General_Parms>"]
["Name",{"$f":"IF(n_e=1,\"Engine 1\",IF(n_e=2,\"Engine 2\",\"Engine 3\"))","v":"Engine 2"},null,{"$f":"\"<\" & A1213 & \">\" & TEXT(B1213,0) & \"</\" & A1213 & \">\"","v":"<Name>Engine 2</Name>"},null,"<Name>Engine 2</Name>"]
["ColorR",0,null,{"$f":"\"<\" & A1214 & \">\" & TEXT(B1214,\"0.000000\") & \"</\" & A1214 & \">\"","v":"<ColorR>0.000000</ColorR>"},null,"<ColorR>0.000000</ColorR>"]
["ColorG",0,null,{"$f":"\"<\" & A1215 & \">\" & TEXT(B1215,\"0.000000\") & \"</\" & A1215 & \">\"","v":"<ColorG>0.000000</ColorG>"},null,"<ColorG>0.000000</ColorG>"]
["ColorB",255,null,{"$f":"\"<\" & A1216 & \">\" & TEXT(B1216,\"0.000000\") & \"</\" & A1216 & \">\"","v":"<ColorB>255.000000</ColorB>"},null,"<ColorB>255.000000</ColorB>"]
["Symmetry",0,null,{"$f":"\"<\" & A1217 & \">\" & TEXT(B1217,0) & \"</\" & A1217 & \">\"","v":"<Symmetry>0</Symmetry>"},null,"<Symmetry>0</Symmetry>"]
["RelXFormFlag",0,null,"<RelXFormFlag>0</RelXFormFlag>",null,"<RelXFormFlag>0</RelXFormFlag>"]
["MaterialID",0,null,"<MaterialID>0</MaterialID>",null,"<MaterialID>0</MaterialID>"]
["OutputFlag",1,null,"<OutputFlag>1</OutputFlag>",null,"<OutputFlag>1</OutputFlag>"]
["OutputNameID",0,null,"<OutputNameID>0</OutputNameID>",null,"<OutputNameID>0</OutputNameID>"]
["DisplayChildrenFlag",1,null,"<DisplayChildrenFlag>1</DisplayChildrenFlag>",null,"<DisplayChildrenFlag>1</DisplayChildrenFlag>"]
["NumPnts",21,null,"<NumPnts>21</NumPnts>",null,"<NumPnts>21</NumPnts>"]
["NumXsecs",11,null,"<NumXsecs>11</NumXsecs>",null,"<NumXsecs>11</NumXsecs>"]
["MassPrior",0,null,"<MassPrior>0</MassPrior>",null,"<MassPrior>0</MassPrior>"]
["ShellFlag",0,null,"<ShellFlag>0</ShellFlag>",null,"<ShellFlag>0</ShellFlag>"]
["Tran_X",{"$f":"IF(Input!$D$26=\"Jet\",pos_e.j1.x,pos_e.p1.x)","v":23.193146602423081},null,{"$f":"\"<\" & A1227 & \">\" & TEXT(B1227,\"0.000000\") & \"</\" & A1227 & \">\"","v":"<Tran_X>23.193147</Tran_X>"},null,"<Tran_X>13.056760</Tran_X>"]
["Tran_Y",{"$f":"IF(Input!$D$26=\"Jet\",pos_e.j1.y,pos_e.p1.y)","v":9.8231687912404322},null,"<Tran_Y>9.823169</Tran_Y>",null,"<Tran_Y>5.530585</Tran_Y>"]
["Tran_Z",{"$f":"IF(Input!$D$26=\"Jet\",pos_e.j1.z,pos_e.p1.z)","v":-3.1710555412855181},null,"<Tran_Z>-3.171056</Tran_Z>",null,"<Tran_Z>-2.218143</Tran_Z>"]
["TranRel_X",0,null,"<TranRel_X>0.000000</TranRel_X>",null,"<TranRel_X>0.000000</TranRel_X>"]
["TranRel_Y",0,null,"<TranRel_Y>0.000000</TranRel_Y>",null,"<TranRel_Y>0.000000</TranRel_Y>"]
["TranRel_Z",0,null,"<TranRel_Z>0.000000</TranRel_Z>",null,"<TranRel_Z>0.000000</TranRel_Z>"]
["Rot_X",0,null,"<Rot_X>0.000000</Rot_X>",null,"<Rot_X>0.000000</Rot_X>"]
["Rot_Y",0,null,"<Rot_Y>0.000000</Rot_Y>",null,"<Rot_Y>0.000000</Rot_Y>"]
["Rot_Z",0,null,"<Rot_Z>0.000000</Rot_Z>",null,"<Rot_Z>0.000000</Rot_Z>"]
["RotRel_X",0,null,"<RotRel_X>0.000000</RotRel_X>",null,"<RotRel_X>0.000000</RotRel_X>"]
["RotRel_Y",0,null,"<RotRel_Y>0.000000</RotRel_Y>",null,"<RotRel_Y>0.000000</RotRel_Y>"]
["RotRel_Z",0,null,"<RotRel_Z>0.000000</RotRel_Z>",null,"<RotRel_Z>0.000000</RotRel_Z>"]
["Origin",0,null,"<Origin>0.000000</Origin>",null,"<Origin>0.000000</Origin>"]
["Density",1,null,"<Density>1.000000</Density>",null,"<Density>1.000000</Density>"]
["ShellMassArea",1,null,"<ShellMassArea>1.000000</ShellMassArea>",null,"<ShellMassArea>1.000000</ShellMassArea>"]
["RefFlag",0,null,{"$f":"\"<\" & A1242 & \">\" & TEXT(B1242,0) & \"</\" & A1242 & \">\"","v":"<RefFlag>0</RefFlag>"},null,"<RefFlag>0</RefFlag>"]
["RefArea",100,null,{"$f":"\"<\" & A1243 & \">\" & TEXT(B1243,\"0.000000\") & \"</\" & A1243 & \">\"","v":"<RefArea>100.000000</RefArea>"},null,"<RefArea>100.000000</RefArea>"]
["RefSpan",10,null,{"$f":"\"<\" & A1244 & \">\" & TEXT(B1244,\"0.000000\") & \"</\" & A1244 & \">\"","v":"<RefSpan>10.000000</RefSpan>"},null,"<RefSpan>10.000000</RefSpan>"]
["RefCbar",1,null,{"$f":"\"<\" & A1245 & \">\" & TEXT(B1245,\"0.000000\") & \"</\" & A1245 & \">\"","v":"<RefCbar>1.000000</RefCbar>"},null,"<RefCbar>1.000000</RefCbar>"]
["AutoRefAreaFlag",1,null,{"$f":"\"<\" & A1246 & \">\" & TEXT(B1246,0) & \"</\" & A1246 & \">\"","v":"<AutoRefAreaFlag>1</AutoRefAreaFlag>"},null,"<AutoRefAreaFlag>1</AutoRefAreaFlag>"]
["AutoRefSpanFlag",1,null,{"$f":"\"<\" & A1247 & \">\" & TEXT(B1247,0) & \"</\" & A1247 & \">\"","v":"<AutoRefSpanFlag>1</AutoRefSpanFlag>"},null,"<AutoRefSpanFlag>1</AutoRefSpanFlag>"]
["AutoRefCbarFlag",1,null,{"$f":"\"<\" & A1248 & \">\" & TEXT(B1248,0) & \"</\" & A1248 & \">\"","v":"<AutoRefCbarFlag>1</AutoRefCbarFlag>"},null,"<AutoRefCbarFlag>1</AutoRefCbarFlag>"]
["AeroCenter_X",0,null,{"$f":"\"<\" & A1249 & \">\" & TEXT(B1249,\"0.000000\") & \"</\" & A1249 & \">\"","v":"<AeroCenter_X>0.000000</AeroCenter_X>"},null,"<AeroCenter_X>0.000000</AeroCenter_X>"]
["AeroCenter_Y",0,null,{"$f":"\"<\" & A1250 & \">\" & TEXT(B1250,\"0.000000\") & \"</\" & A1250 & \">\"","v":"<AeroCenter_Y>0.000000</AeroCenter_Y>"},null,"<AeroCenter_Y>0.000000</AeroCenter_Y>"]
["AeroCenter_Z",0,null,{"$f":"\"<\" & A1251 & \">\" & TEXT(B1251,\"0.000000\") & \"</\" & A1251 & \">\"","v":"<AeroCenter_Z>0.000000</AeroCenter_Z>"},null,"<AeroCenter_Z>0.000000</AeroCenter_Z>"]
["AutoAeroCenterFlag",1,null,{"$f":"\"<\" & A1252 & \">\" & TEXT(B1252,0) & \"</\" & A1252 & \">\"","v":"<AutoAeroCenterFlag>1</AutoAeroCenterFlag>"},null,"<AutoAeroCenterFlag>1</AutoAeroCenterFlag>"]
["WakeActiveFlag",0,null,{"$f":"\"<\" & A1253 & \">\" & TEXT(B1253,0) & \"</\" & A1253 & \">\"","v":"<WakeActiveFlag>0</WakeActiveFlag>"},null,"<WakeActiveFlag>0</WakeActiveFlag>"]
["PosAttachFlag",0,null,{"$f":"\"<\" & A1254 & \">\" & TEXT(B1254,0) & \"</\" & A1254 & \">\"","v":"<PosAttachFlag>0</PosAttachFlag>"},null,"<PosAttachFlag>0</PosAttachFlag>"]
["U_Attach",0,null,{"$f":"\"<\" & A1255 & \">\" & TEXT(B1255,\"0.000000\") & \"</\" & A1255 & \">\"","v":"<U_Attach>0.000000</U_Attach>"},null,"<U_Attach>0.000000</U_Attach>"]
["V_Attach",0,null,{"$f":"\"<\" & A1256 & \">\" & TEXT(B1256,\"0.000000\") & \"</\" & A1256 & \">\"","v":"<V_Attach>0.000000</V_Attach>"},null,"<V_Attach>0.000000</V_Attach>"]
["PtrID",148271640,null,{"$f":"\"<\" & A1257 & \">\" & TEXT(B1257,0) & \"</\" & A1257 & \">\"","v":"<PtrID>148271640</PtrID>"},null,"<PtrID>148271640</PtrID>"]
["Parent_PtrID",0,null,"<Parent_PtrID>0</Parent_PtrID>",null,"<Parent_PtrID>0</Parent_PtrID>"]
["Children_PtrID",148274736,null,"<Children_PtrID>148274736</Children_PtrID>",null,"<Children_PtrID>148274736</Children_PtrID>"]
["Children_PtrID",148485072,null,"<Children_PtrID>148485072</Children_PtrID>",null,"<Children_PtrID>148485072</Children_PtrID>"]
["Children_PtrID",148458296,null,"<Children_PtrID>148458296</Children_PtrID>",null,"<Children_PtrID>148458296</Children_PtrID>"]
["Children_PtrID",854381,null,"<Children_PtrID>854381</Children_PtrID>",null,"<Children_PtrID>854381</Children_PtrID>"]
["/General_Parms",null,null,{"$f":"\"<\" & A1263 & \">\"","v":"</General_Parms>"},null,"</General_Parms>"]
["Blank_Parms",null,null,{"$f":"\"<\" & A1264 & \">\"","v":"<Blank_Parms>"},null,"<Blank_Parms>"]
["PointMassFlag",0,null,{"$f":"\"<\" & A1265 & \">\" & TEXT(B1265,0) & \"</\" & A1265 & \">\"","v":"<PointMassFlag>0</PointMassFlag>"},null,"<PointMassFlag>0</PointMassFlag>"]
["PointMass",1,null,{"$f":"\"<\" & A1266 & \">\" & TEXT(B1266,\"0.000000\") & \"</\" & A1266 & \">\"","v":"<PointMass>1.000000</PointMass>"},null,"<PointMass>1.000000</PointMass>"]
["/Blank_Parms",null,null,{"$f":"\"<\" & A1267 & \">\"","v":"</Blank_Parms>"},null,"</Blank_Parms>"]
["/Component",null,null,{"$f":"\"<\" & A1268 & \">\"","v":"</Component>"},null,"</Component>"]
["Component","CoreSect",null,{"$f":"\"<\" & A1269 & \">\"","v":"<Component>"},null,"<Component>"]
["Type","Engine",null,{"$f":"\"<\" & A1270 & \">\" & TEXT(B1270,\"0.000000\") & \"</\" & A1270 & \">\"","v":"<Type>Engine</Type>"},null,"<Type>Engine</Type>"]
["General_Parms",null,null,{"$f":"\"<\" & A1271 & \">\"","v":"<General_Parms>"},null,"<General_Parms>"]
["Name","core_section",null,{"$f":"\"<\" & A1272 & \">\" & TEXT(B1272,\"0.000000\") & \"</\" & A1272 & \">\"","v":"<Name>core_section</Name>"},null,"<Name>core_section</Name>"]
["ColorR",0,null,{"$f":"\"<\" & A1273 & \">\" & TEXT(B1273,\"0.000000\") & \"</\" & A1273 & \">\"","v":"<ColorR>0.000000</ColorR>"},null,"<ColorR>0.000000</ColorR>"]
["ColorG",0,null,{"$f":"\"<\" & A1274 & \">\" & TEXT(B1274,\"0.000000\") & \"</\" & A1274 & \">\"","v":"<ColorG>0.000000</ColorG>"},null,"<ColorG>0.000000</ColorG>"]
["ColorB",0,null,{"$f":"\"<\" & A1275 & \">\" & TEXT(B1275,\"0.000000\") & \"</\" & A1275 & \">\"","v":"<ColorB>0.000000</ColorB>"},null,"<ColorB>0.000000</ColorB>"]
["Symmetry",0,null,{"$f":"\"<\" & A1276 & \">\" & TEXT(B1276,0) & \"</\" & A1276 & \">\"","v":"<Symmetry>0</Symmetry>"},null,"<Symmetry>0</Symmetry>"]
["RelXFormFlag",0,null,"<RelXFormFlag>0</RelXFormFlag>",null,"<RelXFormFlag>0</RelXFormFlag>"]
["MaterialID",2,null,"<MaterialID>2</MaterialID>",null,"<MaterialID>2</MaterialID>"]
["OutputFlag",1,null,"<OutputFlag>1</OutputFlag>",null,"<OutputFlag>1</OutputFlag>"]
["OutputNameID",0,null,"<OutputNameID>0</OutputNameID>",null,"<OutputNameID>0</OutputNameID>"]
["DisplayChildrenFlag",1,null,"<DisplayChildrenFlag>1</DisplayChildrenFlag>",null,"<DisplayChildrenFlag>1</DisplayChildrenFlag>"]
["NumPnts",21,null,"<NumPnts>21</NumPnts>",null,"<NumPnts>21</NumPnts>"]
["NumXsecs",11,null,"<NumXsecs>11</NumXsecs>",null,"<NumXsecs>11</NumXsecs>"]
["MassPrior",0,null,"<MassPrior>0</MassPrior>",null,"<MassPrior>0</MassPrior>"]
["ShellFlag",0,null,"<ShellFlag>0</ShellFlag>",null,"<ShellFlag>0</ShellFlag>"]
["Tran_X",{"$f":"IF(n_e=1, IF(Type_e = \"Jet\", c_r.V, 0), 0)","v":0},null,{"$f":"\"<\" & A1286 & \">\" & TEXT(B1286,\"0.000000\") & \"</\" & A1286 & \">\"","v":"<Tran_X>0.000000</Tran_X>"},null,"<Tran_X>0.000000</Tran_X>"]
["Tran_Y",0,null,"<Tran_Y>0.000000</Tran_Y>",null,"<Tran_Y>0.000000</Tran_Y>"]
["Tran_Z",0,null,"<Tran_Z>0.000000</Tran_Z>",null,"<Tran_Z>0.000000</Tran_Z>"]
["TranRel_X",0,null,"<TranRel_X>0.000000</TranRel_X>",null,"<TranRel_X>0.000000</TranRel_X>"]
["TranRel_Y",0,null,"<TranRel_Y>0.000000</TranRel_Y>",null,"<TranRel_Y>0.000000</TranRel_Y>"]
["TranRel_Z",0,null,"<TranRel_Z>0.000000</TranRel_Z>",null,"<TranRel_Z>0.000000</TranRel_Z>"]
["Rot_X",0,null,"<Rot_X>0.000000</Rot_X>",null,"<Rot_X>0.000000</Rot_X>"]
["Rot_Y",0,null,"<Rot_Y>0.000000</Rot_Y>",null,"<Rot_Y>0.000000</Rot_Y>"]
["Rot_Z",0,null,"<Rot_Z>0.000000</Rot_Z>",null,"<Rot_Z>0.000000</Rot_Z>"]
["RotRel_X",0,null,"<RotRel_X>0.000000</RotRel_X>",null,"<RotRel_X>0.000000</RotRel_X>"]
["RotRel_Y",0,null,"<RotRel_Y>0.000000</RotRel_Y>",null,"<RotRel_Y>0.000000</RotRel_Y>"]
["RotRel_Z",0,null,"<RotRel_Z>0.000000</RotRel_Z>",null,"<RotRel_Z>0.000000</RotRel_Z>"]
["Origin",0,null,"<Origin>0.000000</Origin>",null,"<Origin>0.000000</Origin>"]
["Density",1,null,"<Density>1.000000</Density>",null,"<Density>1.000000</Density>"]
["ShellMassArea",1,null,"<ShellMassArea>1.000000</ShellMassArea>",null,"<ShellMassArea>1.000000</ShellMassArea>"]
["RefFlag",0,null,{"$f":"\"<\" & A1301 & \">\" & TEXT(B1301,0) & \"</\" & A1301 & \">\"","v":"<RefFlag>0</RefFlag>"},null,"<RefFlag>0</RefFlag>"]
["RefArea",100,null,{"$f":"\"<\" & A1302 & \">\" & TEXT(B1302,\"0.000000\") & \"</\" & A1302 & \">\"","v":"<RefArea>100.000000</RefArea>"},null,"<RefArea>100.000000</RefArea>"]
["RefSpan",10,null,{"$f":"\"<\" & A1303 & \">\" & TEXT(B1303,\"0.000000\") & \"</\" & A1303 & \">\"","v":"<RefSpan>10.000000</RefSpan>"},null,"<RefSpan>10.000000</RefSpan>"]
["RefCbar",1,null,{"$f":"\"<\" & A1304 & \">\" & TEXT(B1304,\"0.000000\") & \"</\" & A1304 & \">\"","v":"<RefCbar>1.000000</RefCbar>"},null,"<RefCbar>1.000000</RefCbar>"]
["AutoRefAreaFlag",1,null,{"$f":"\"<\" & A1305 & \">\" & TEXT(B1305,0) & \"</\" & A1305 & \">\"","v":"<AutoRefAreaFlag>1</AutoRefAreaFlag>"},null,"<AutoRefAreaFlag>1</AutoRefAreaFlag>"]
["AutoRefSpanFlag",1,null,{"$f":"\"<\" & A1306 & \">\" & TEXT(B1306,0) & \"</\" & A1306 & \">\"","v":"<AutoRefSpanFlag>1</AutoRefSpanFlag>"},null,"<AutoRefSpanFlag>1</AutoRefSpanFlag>"]
["AutoRefCbarFlag",1,null,{"$f":"\"<\" & A1307 & \">\" & TEXT(B1307,0) & \"</\" & A1307 & \">\"","v":"<AutoRefCbarFlag>1</AutoRefCbarFlag>"},null,"<AutoRefCbarFlag>1</AutoRefCbarFlag>"]
["AeroCenter_X",0,null,{"$f":"\"<\" & A1308 & \">\" & TEXT(B1308,\"0.000000\") & \"</\" & A1308 & \">\"","v":"<AeroCenter_X>0.000000</AeroCenter_X>"},null,"<AeroCenter_X>0.000000</AeroCenter_X>"]
["AeroCenter_Y",0,null,{"$f":"\"<\" & A1309 & \">\" & TEXT(B1309,\"0.000000\") & \"</\" & A1309 & \">\"","v":"<AeroCenter_Y>0.000000</AeroCenter_Y>"},null,"<AeroCenter_Y>0.000000</AeroCenter_Y>"]
["AeroCenter_Z",0,null,{"$f":"\"<\" & A1310 & \">\" & TEXT(B1310,\"0.000000\") & \"</\" & A1310 & \">\"","v":"<AeroCenter_Z>0.000000</AeroCenter_Z>"},null,"<AeroCenter_Z>0.000000</AeroCenter_Z>"]
["AutoAeroCenterFlag",1,null,{"$f":"\"<\" & A1311 & \">\" & TEXT(B1311,0) & \"</\" & A1311 & \">\"","v":"<AutoAeroCenterFlag>1</AutoAeroCenterFlag>"},null,"<AutoAeroCenterFlag>1</AutoAeroCenterFlag>"]
["WakeActiveFlag",0,null,{"$f":"\"<\" & A1312 & \">\" & TEXT(B1312,0) & \"</\" & A1312 & \">\"","v":"<WakeActiveFlag>0</WakeActiveFlag>"},null,"<WakeActiveFlag>0</WakeActiveFlag>"]
["PosAttachFlag",3,null,{"$f":"\"<\" & A1313 & \">\" & TEXT(B1313,0) & \"</\" & A1313 & \">\"","v":"<PosAttachFlag>3</PosAttachFlag>"},null,"<PosAttachFlag>3</PosAttachFlag>"]
["U_Attach",0,null,{"$f":"\"<\" & A1314 & \">\" & TEXT(B1314,\"0.000000\") & \"</\" & A1314 & \">\"","v":"<U_Attach>0.000000</U_Attach>"},null,"<U_Attach>0.000000</U_Attach>"]
["V_Attach",0,null,{"$f":"\"<\" & A1315 & \">\" & TEXT(B1315,\"0.000000\") & \"</\" & A1315 & \">\"","v":"<V_Attach>0.000000</V_Attach>"},null,"<V_Attach>0.000000</V_Attach>"]
["PtrID",148274736,null,{"$f":"\"<\" & A1316 & \">\" & TEXT(B1316,0) & \"</\" & A1316 & \">\"","v":"<PtrID>148274736</PtrID>"},null,"<PtrID>148274736</PtrID>"]
["Parent_PtrID",148271640,null,{"$f":"\"<\" & A1317 & \">\" & TEXT(B1317,0) & \"</\" & A1317 & \">\"","v":"<Parent_PtrID>148271640</Parent_PtrID>"},null,"<Parent_PtrID>148271640</Parent_PtrID>"]
["/General_Parms",null,null,{"$f":"\"<\" & A1318 & \">\"","v":"</General_Parms>"},null,"</General_Parms>"]
["Engine_Parms",null,null,{"$f":"\"<\" & A1319 & \">\"","v":"<Engine_Parms>"},null,"<Engine_Parms>"]
["Engine_Type",0,null,{"$f":"\"<\" & A1320 & \">\" & TEXT(B1320,0) & \"</\" & A1320 & \">\"","v":"<Engine_Type>0</Engine_Type>"},null,"<Engine_Type>0</Engine_Type>"]
["Radius_Tip",{"$f":"IF(Type_e=\"Jet\",0.25*d_e.j,0.5*d_e.p)","v":0.84499999999999997},null,{"$f":"\"<\" & A1321 & \">\" & TEXT(B1321,\"0.000000\") & \"</\" & A1321 & \">\"","v":"<Radius_Tip>0.845000</Radius_Tip>"},null,"<Radius_Tip>0.410868</Radius_Tip>"]
["Max_Tip",1.3,null,{"$f":"\"<\" & A1322 & \">\" & TEXT(B1322,\"0.000000\") & \"</\" & A1322 & \">\"","v":"<Max_Tip>1.300000</Max_Tip>"},null,"<Max_Tip>1.300000</Max_Tip>"]
["Hub_Tip",{"$f":"IF(Type_e=\"Jet\",0.5,0.99)","v":0.5},null,{"$f":"\"<\" & A1323 & \">\" & TEXT(B1323,\"0.000000\") & \"</\" & A1323 & \">\"","v":"<Hub_Tip>0.500000</Hub_Tip>"},null,"<Hub_Tip>0.500000</Hub_Tip>"]
["Eng_Length",0,null,{"$f":"\"<\" & A1324 & \">\" & TEXT(B1324,\"0.000000\") & \"</\" & A1324 & \">\"","v":"<Eng_Length>0.000000</Eng_Length>"},null,"<Eng_Length>0.000000</Eng_Length>"]
["Inlet_Type",1,null,{"$f":"\"<\" & A1325 & \">\" & TEXT(B1325,0) & \"</\" & A1325 & \">\"","v":"<Inlet_Type>1</Inlet_Type>"},null,"<Inlet_Type>1</Inlet_Type>"]
["Inl_Noz_Color",0,null,{"$f":"\"<\" & A1326 & \">\" & TEXT(B1326,0) & \"</\" & A1326 & \">\"","v":"<Inl_Noz_Color>0</Inl_Noz_Color>"},null,"<Inl_Noz_Color>0</Inl_Noz_Color>"]
["Inlet_XY_Sym_Flag",0,null,{"$f":"\"<\" & A1327 & \">\" & TEXT(B1327,0) & \"</\" & A1327 & \">\"","v":"<Inlet_XY_Sym_Flag>0</Inlet_XY_Sym_Flag>"},null,"<Inlet_XY_Sym_Flag>0</Inlet_XY_Sym_Flag>"]
["Inlet_Half_Split_Flag",0,null,{"$f":"\"<\" & A1328 & \">\" & TEXT(B1328,0) & \"</\" & A1328 & \">\"","v":"<Inlet_Half_Split_Flag>0</Inlet_Half_Split_Flag>"},null,"<Inlet_Half_Split_Flag>0</Inlet_Half_Split_Flag>"]
["Cowl_Length",1E-3,null,{"$f":"\"<\" & A1329 & \">\" & TEXT(B1329,\"0.000000\") & \"</\" & A1329 & \">\"","v":"<Cowl_Length>0.001000</Cowl_Length>"},null,"<Cowl_Length>0.001000</Cowl_Length>"]
["Eng_Thrt_Ratio",1.5,null,"<Eng_Thrt_Ratio>1.500000</Eng_Thrt_Ratio>",null,"<Eng_Thrt_Ratio>1.500000</Eng_Thrt_Ratio>"]
["Hilight_Thrt_Ratio",1.3,null,"<Hilight_Thrt_Ratio>1.300000</Hilight_Thrt_Ratio>",null,"<Hilight_Thrt_Ratio>1.300000</Hilight_Thrt_Ratio>"]
["Lip_Finess_Ratio",1.9,null,"<Lip_Finess_Ratio>1.900000</Lip_Finess_Ratio>",null,"<Lip_Finess_Ratio>1.900000</Lip_Finess_Ratio>"]
["Height_Width_Ratio",1,null,"<Height_Width_Ratio>1.000000</Height_Width_Ratio>",null,"<Height_Width_Ratio>1.000000</Height_Width_Ratio>"]
["Upper_Surf_Shape_Factor",-1.3,null,"<Upper_Surf_Shape_Factor>-1.300000</Upper_Surf_Shape_Factor>",null,"<Upper_Surf_Shape_Factor>-1.300000</Upper_Surf_Shape_Factor>"]
["Lower_Surf_Shape_Factor",0.7,null,"<Lower_Surf_Shape_Factor>0.700000</Lower_Surf_Shape_Factor>",null,"<Lower_Surf_Shape_Factor>0.700000</Lower_Surf_Shape_Factor>"]
["Inlet_X_Axis_Rot",0,null,"<Inlet_X_Axis_Rot>0.000000</Inlet_X_Axis_Rot>",null,"<Inlet_X_Axis_Rot>0.000000</Inlet_X_Axis_Rot>"]
["Inlet_Scarf_Angle",0,null,"<Inlet_Scarf_Angle>0.000000</Inlet_Scarf_Angle>",null,"<Inlet_Scarf_Angle>0.000000</Inlet_Scarf_Angle>"]
["Inlet_Duct_On_Off",0,null,{"$f":"\"<\" & A1338 & \">\" & TEXT(B1338,0) & \"</\" & A1338 & \">\"","v":"<Inlet_Duct_On_Off>0</Inlet_Duct_On_Off>"},null,"<Inlet_Duct_On_Off>0</Inlet_Duct_On_Off>"]
["Inlet_Duct_X_Offset",3,null,{"$f":"\"<\" & A1339 & \">\" & TEXT(B1339,\"0.000000\") & \"</\" & A1339 & \">\"","v":"<Inlet_Duct_X_Offset>3.000000</Inlet_Duct_X_Offset>"},null,"<Inlet_Duct_X_Offset>3.000000</Inlet_Duct_X_Offset>"]
["Inlet_Duct_Y_Offset",1,null,{"$f":"\"<\" & A1340 & \">\" & TEXT(B1340,\"0.000000\") & \"</\" & A1340 & \">\"","v":"<Inlet_Duct_Y_Offset>1.000000</Inlet_Duct_Y_Offset>"},null,"<Inlet_Duct_Y_Offset>1.000000</Inlet_Duct_Y_Offset>"]
["Inlet_Duct_Shape_Factor",0.5,null,{"$f":"\"<\" & A1341 & \">\" & TEXT(B1341,\"0.000000\") & \"</\" & A1341 & \">\"","v":"<Inlet_Duct_Shape_Factor>0.500000</Inlet_Duct_Shape_Factor>"},null,"<Inlet_Duct_Shape_Factor>0.500000</Inlet_Duct_Shape_Factor>"]
["Divertor_On_Off",0,null,{"$f":"\"<\" & A1342 & \">\" & TEXT(B1342,0) & \"</\" & A1342 & \">\"","v":"<Divertor_On_Off>0</Divertor_On_Off>"},null,"<Divertor_On_Off>0</Divertor_On_Off>"]
["Divertor_Height",0.5,null,{"$f":"\"<\" & A1343 & \">\" & TEXT(B1343,\"0.000000\") & \"</\" & A1343 & \">\"","v":"<Divertor_Height>0.500000</Divertor_Height>"},null,"<Divertor_Height>0.500000</Divertor_Height>"]
["Divertor_Length",1,null,{"$f":"\"<\" & A1344 & \">\" & TEXT(B1344,\"0.000000\") & \"</\" & A1344 & \">\"","v":"<Divertor_Length>1.000000</Divertor_Length>"},null,"<Divertor_Length>1.000000</Divertor_Length>"]
["Nozzle_Type",0,null,{"$f":"\"<\" & A1345 & \">\" & TEXT(B1345,0) & \"</\" & A1345 & \">\"","v":"<Nozzle_Type>0</Nozzle_Type>"},null,"<Nozzle_Type>0</Nozzle_Type>"]
["Nozzle_Length",{"$f":"IF(Type_e=\"Jet\",l_e.j/B1321,l_e.p/B1321)","v":5.4907500000000011},null,{"$f":"\"<\" & A1346 & \">\" & TEXT(B1346,\"0.000000\") & \"</\" & A1346 & \">\"","v":"<Nozzle_Length>5.490750</Nozzle_Length>"},null,"<Nozzle_Length>7.298784</Nozzle_Length>"]
["Exit_Area_Ratio",3,null,{"$f":"\"<\" & A1347 & \">\" & TEXT(B1347,\"0.000000\") & \"</\" & A1347 & \">\"","v":"<Exit_Area_Ratio>3.000000</Exit_Area_Ratio>"},null,"<Exit_Area_Ratio>3.000000</Exit_Area_Ratio>"]
["Nozzle_Height_Width_Ratio",1,null,{"$f":"\"<\" & A1348 & \">\" & TEXT(B1348,\"0.000000\") & \"</\" & A1348 & \">\"","v":"<Nozzle_Height_Width_Ratio>1.000000</Nozzle_Height_Width_Ratio>"},null,"<Nozzle_Height_Width_Ratio>1.000000</Nozzle_Height_Width_Ratio>"]
["Exit_Throat_Ratio",1.5,null,{"$f":"\"<\" & A1349 & \">\" & TEXT(B1349,\"0.000000\") & \"</\" & A1349 & \">\"","v":"<Exit_Throat_Ratio>1.500000</Exit_Throat_Ratio>"},null,"<Exit_Throat_Ratio>1.500000</Exit_Throat_Ratio>"]
["Dive_Flap_Ratio",1,null,{"$f":"\"<\" & A1350 & \">\" & TEXT(B1350,\"0.000000\") & \"</\" & A1350 & \">\"","v":"<Dive_Flap_Ratio>1.000000</Dive_Flap_Ratio>"},null,"<Dive_Flap_Ratio>1.000000</Dive_Flap_Ratio>"]
["Nozzle_Duct_On_Off",0,null,{"$f":"\"<\" & A1351 & \">\" & TEXT(B1351,0) & \"</\" & A1351 & \">\"","v":"<Nozzle_Duct_On_Off>0</Nozzle_Duct_On_Off>"},null,"<Nozzle_Duct_On_Off>0</Nozzle_Duct_On_Off>"]
["Nozzle_Duct_X_Offset",1,null,{"$f":"\"<\" & A1352 & \">\" & TEXT(B1352,\"0.000000\") & \"</\" & A1352 & \">\"","v":"<Nozzle_Duct_X_Offset>1.000000</Nozzle_Duct_X_Offset>"},null,"<Nozzle_Duct_X_Offset>1.000000</Nozzle_Duct_X_Offset>"]
["Nozzle_Duct_Y_Offset",0,null,{"$f":"\"<\" & A1353 & \">\" & TEXT(B1353,\"0.000000\") & \"</\" & A1353 & \">\"","v":"<Nozzle_Duct_Y_Offset>0.000000</Nozzle_Duct_Y_Offset>"},null,"<Nozzle_Duct_Y_Offset>0.000000</Nozzle_Duct_Y_Offset>"]
["Nozzle_Duct_Shape_Factor",0,null,{"$f":"\"<\" & A1354 & \">\" & TEXT(B1354,\"0.000000\") & \"</\" & A1354 & \">\"","v":"<Nozzle_Duct_Shape_Factor>0.000000</Nozzle_Duct_Shape_Factor>"},null,"<Nozzle_Duct_Shape_Factor>0.000000</Nozzle_Duct_Shape_Factor>"]
["/Engine_Parms",null,null,{"$f":"\"<\" & A1355 & \">\"","v":"</Engine_Parms>"},null,"</Engine_Parms>"]
["/Component",null,null,{"$f":"\"<\" & A1356 & \">\"","v":"</Component>"},null,"</Component>"]
["Component","Prop Rotor",{"$f":"IF(Input!$D$26=\"Jet\",\"No\",\"Yes\")","v":"No"},{"$f":"IF(C1357=\"Yes\",(\"<\"&A1357&\">\"),(\"<!--\"&A1357&\">\"))","v":"<!--Component>"},null,"<!--Component>"]
["Type","Prop",null,{"$f":"\"<\" & A1358 & \">\" & TEXT(B1358,\"0.000000\") & \"</\" & A1358 & \">\"","v":"<Type>Prop</Type>"},null,"<Type>Prop</Type>"]
["General_Parms",null,null,{"$f":"\"<\" & A1359 & \">\"","v":"<General_Parms>"},null,"<General_Parms>"]
["Name","Rotor",null,{"$f":"\"<\" & A1360 & \">\" & TEXT(B1360,\"0.000000\") & \"</\" & A1360 & \">\"","v":"<Name>Rotor</Name>"},null,"<Name>Rotor</Name>"]
["ColorR",127,null,{"$f":"\"<\" & A1361 & \">\" & TEXT(B1361,\"0.000000\") & \"</\" & A1361 & \">\"","v":"<ColorR>127.000000</ColorR>"},null,"<ColorR>127.000000</ColorR>"]
["ColorG",127,null,{"$f":"\"<\" & A1362 & \">\" & TEXT(B1362,\"0.000000\") & \"</\" & A1362 & \">\"","v":"<ColorG>127.000000</ColorG>"},null,"<ColorG>127.000000</ColorG>"]
["ColorB",127,null,{"$f":"\"<\" & A1363 & \">\" & TEXT(B1363,\"0.000000\") & \"</\" & A1363 & \">\"","v":"<ColorB>127.000000</ColorB>"},null,"<ColorB>127.000000</ColorB>"]
["Symmetry",0,null,{"$f":"\"<\" & A1364 & \">\" & TEXT(B1364,0) & \"</\" & A1364 & \">\"","v":"<Symmetry>0</Symmetry>"},null,"<Symmetry>0</Symmetry>"]
["RelXFormFlag",0,null,"<RelXFormFlag>0</RelXFormFlag>",null,"<RelXFormFlag>0</RelXFormFlag>"]
["MaterialID",0,null,"<MaterialID>0</MaterialID>",null,"<MaterialID>0</MaterialID>"]
["OutputFlag",1,null,"<OutputFlag>1</OutputFlag>",null,"<OutputFlag>1</OutputFlag>"]
["OutputNameID",0,null,"<OutputNameID>0</OutputNameID>",null,"<OutputNameID>0</OutputNameID>"]
["DisplayChildrenFlag",1,null,"<DisplayChildrenFlag>1</DisplayChildrenFlag>",null,"<DisplayChildrenFlag>1</DisplayChildrenFlag>"]
["NumPnts",21,null,"<NumPnts>21</NumPnts>",null,"<NumPnts>21</NumPnts>"]
["NumXsecs",11,null,"<NumXsecs>11</NumXsecs>",null,"<NumXsecs>11</NumXsecs>"]
["MassPrior",0,null,"<MassPrior>0</MassPrior>",null,"<MassPrior>0</MassPrior>"]
["ShellFlag",0,null,"<ShellFlag>0</ShellFlag>",null,"<ShellFlag>0</ShellFlag>"]
["Tran_X",0,null,{"$f":"\"<\" & A1374 & \">\" & TEXT(B1374,\"0.000000\") & \"</\" & A1374 & \">\"","v":"<Tran_X>0.000000</Tran_X>"},null,"<Tran_X>0.000000</Tran_X>"]
["Tran_Y",0,null,"<Tran_Y>0.000000</Tran_Y>",null,"<Tran_Y>0.000000</Tran_Y>"]
["Tran_Z",0,null,"<Tran_Z>0.000000</Tran_Z>",null,"<Tran_Z>0.000000</Tran_Z>"]
["TranRel_X",0,null,"<TranRel_X>0.000000</TranRel_X>",null,"<TranRel_X>0.000000</TranRel_X>"]
["TranRel_Y",0,null,"<TranRel_Y>0.000000</TranRel_Y>",null,"<TranRel_Y>0.000000</TranRel_Y>"]
["TranRel_Z",0,null,"<TranRel_Z>0.000000</TranRel_Z>",null,"<TranRel_Z>0.000000</TranRel_Z>"]
["Rot_X",0,null,"<Rot_X>0.000000</Rot_X>",null,"<Rot_X>0.000000</Rot_X>"]
["Rot_Y",0,null,"<Rot_Y>0.000000</Rot_Y>",null,"<Rot_Y>0.000000</Rot_Y>"]
["Rot_Z",0,null,"<Rot_Z>0.000000</Rot_Z>",null,"<Rot_Z>0.000000</Rot_Z>"]
["RotRel_X",0,null,"<RotRel_X>0.000000</RotRel_X>",null,"<RotRel_X>0.000000</RotRel_X>"]
["RotRel_Y",0,null,"<RotRel_Y>0.000000</RotRel_Y>",null,"<RotRel_Y>0.000000</RotRel_Y>"]
["RotRel_Z",0,null,"<RotRel_Z>0.000000</RotRel_Z>",null,"<RotRel_Z>0.000000</RotRel_Z>"]
["Origin",0,null,"<Origin>0.000000</Origin>",null,"<Origin>0.000000</Origin>"]
["Density",1,null,"<Density>1.000000</Density>",null,"<Density>1.000000</Density>"]
["ShellMassArea",1,null,"<ShellMassArea>1.000000</ShellMassArea>",null,"<ShellMassArea>1.000000</ShellMassArea>"]
["RefFlag",0,null,{"$f":"\"<\" & A1389 & \">\" & TEXT(B1389,0) & \"</\" & A1389 & \">\"","v":"<RefFlag>0</RefFlag>"},null,"<RefFlag>0</RefFlag>"]
["RefArea",100,null,{"$f":"\"<\" & A1390 & \">\" & TEXT(B1390,\"0.000000\") & \"</\" & A1390 & \">\"","v":"<RefArea>100.000000</RefArea>"},null,"<RefArea>100.000000</RefArea>"]
["RefSpan",10,null,{"$f":"\"<\" & A1391 & \">\" & TEXT(B1391,\"0.000000\") & \"</\" & A1391 & \">\"","v":"<RefSpan>10.000000</RefSpan>"},null,"<RefSpan>10.000000</RefSpan>"]
["RefCbar",1,null,{"$f":"\"<\" & A1392 & \">\" & TEXT(B1392,\"0.000000\") & \"</\" & A1392 & \">\"","v":"<RefCbar>1.000000</RefCbar>"},null,"<RefCbar>1.000000</RefCbar>"]
["AutoRefAreaFlag",1,null,{"$f":"\"<\" & A1393 & \">\" & TEXT(B1393,0) & \"</\" & A1393 & \">\"","v":"<AutoRefAreaFlag>1</AutoRefAreaFlag>"},null,"<AutoRefAreaFlag>1</AutoRefAreaFlag>"]
["AutoRefSpanFlag",1,null,{"$f":"\"<\" & A1394 & \">\" & TEXT(B1394,0) & \"</\" & A1394 & \">\"","v":"<AutoRefSpanFlag>1</AutoRefSpanFlag>"},null,"<AutoRefSpanFlag>1</AutoRefSpanFlag>"]
["AutoRefCbarFlag",1,null,{"$f":"\"<\" & A1395 & \">\" & TEXT(B1395,0) & \"</\" & A1395 & \">\"","v":"<AutoRefCbarFlag>1</AutoRefCbarFlag>"},null,"<AutoRefCbarFlag>1</AutoRefCbarFlag>"]
["AeroCenter_X",0,null,{"$f":"\"<\" & A1396 & \">\" & TEXT(B1396,\"0.000000\") & \"</\" & A1396 & \">\"","v":"<AeroCenter_X>0.000000</AeroCenter_X>"},null,"<AeroCenter_X>0.000000</AeroCenter_X>"]
["AeroCenter_Y",0,null,{"$f":"\"<\" & A1397 & \">\" & TEXT(B1397,\"0.000000\") & \"</\" & A1397 & \">\"","v":"<AeroCenter_Y>0.000000</AeroCenter_Y>"},null,"<AeroCenter_Y>0.000000</AeroCenter_Y>"]
["AeroCenter_Z",0,null,{"$f":"\"<\" & A1398 & \">\" & TEXT(B1398,\"0.000000\") & \"</\" & A1398 & \">\"","v":"<AeroCenter_Z>0.000000</AeroCenter_Z>"},null,"<AeroCenter_Z>0.000000</AeroCenter_Z>"]
["AutoAeroCenterFlag",1,null,{"$f":"\"<\" & A1399 & \">\" & TEXT(B1399,0) & \"</\" & A1399 & \">\"","v":"<AutoAeroCenterFlag>1</AutoAeroCenterFlag>"},null,"<AutoAeroCenterFlag>1</AutoAeroCenterFlag>"]
["WakeActiveFlag",0,null,{"$f":"\"<\" & A1400 & \">\" & TEXT(B1400,0) & \"</\" & A1400 & \">\"","v":"<WakeActiveFlag>0</WakeActiveFlag>"},null,"<WakeActiveFlag>0</WakeActiveFlag>"]
["PosAttachFlag",3,null,{"$f":"\"<\" & A1401 & \">\" & TEXT(B1401,0) & \"</\" & A1401 & \">\"","v":"<PosAttachFlag>3</PosAttachFlag>"},null,"<PosAttachFlag>3</PosAttachFlag>"]
["U_Attach",0,null,{"$f":"\"<\" & A1402 & \">\" & TEXT(B1402,\"0.000000\") & \"</\" & A1402 & \">\"","v":"<U_Attach>0.000000</U_Attach>"},null,"<U_Attach>0.000000</U_Attach>"]
["V_Attach",0,null,{"$f":"\"<\" & A1403 & \">\" & TEXT(B1403,\"0.000000\") & \"</\" & A1403 & \">\"","v":"<V_Attach>0.000000</V_Attach>"},null,"<V_Attach>0.000000</V_Attach>"]
["PtrID",854381,null,{"$f":"\"<\" & A1404 & \">\" & TEXT(B1404,0) & \"</\" & A1404 & \">\"","v":"<PtrID>854381</PtrID>"},null,"<PtrID>854381</PtrID>"]
["Parent_PtrID",148271640,null,{"$f":"\"<\" & A1405 & \">\" & TEXT(B1405,0) & \"</\" & A1405 & \">\"","v":"<Parent_PtrID>148271640</Parent_PtrID>"},null,"<Parent_PtrID>148271640</Parent_PtrID>"]
["/General_Parms",null,null,{"$f":"\"<\" & A1406 & \">\"","v":"</General_Parms>"},null,"</General_Parms>"]
["Prop_Parms",null,null,{"$f":"\"<\" & A1407 & \">\"","v":"<Prop_Parms>"},null,"<Prop_Parms>"]
["NumBlades",{"$f":"n_b.p","v":6},null,{"$f":"\"<\" & A1408 & \">\" & TEXT(B1408,0) & \"</\" & A1408 & \">\"","v":"<NumBlades>6</NumBlades>"},null,"<NumBlades>6</NumBlades>"]
["SmoothFlag",1,null,{"$f":"\"<\" & A1409 & \">\" & TEXT(B1409,0) & \"</\" & A1409 & \">\"","v":"<SmoothFlag>1</SmoothFlag>"},null,"<SmoothFlag>1</SmoothFlag>"]
["NumU",3,null,{"$f":"\"<\" & A1410 & \">\" & TEXT(B1410,0) & \"</\" & A1410 & \">\"","v":"<NumU>3</NumU>"},null,"<NumU>3</NumU>"]
["NumW",1,null,{"$f":"\"<\" & A1411 & \">\" & TEXT(B1411,0) & \"</\" & A1411 & \">\"","v":"<NumW>1</NumW>"},null,"<NumW>1</NumW>"]
["Diameter",{"$f":"d_e.p.r","v":3.8910028638910115},null,{"$f":"\"<\" & A1412 & \">\" & TEXT(B1412,\"0.000000\") & \"</\" & A1412 & \">\"","v":"<Diameter>3.891003</Diameter>"},null,"<Diameter>3.171557</Diameter>"]
["ConeAngle",0,null,{"$f":"\"<\" & A1413 & \">\" & TEXT(B1413,\"0.000000\") & \"</\" & A1413 & \">\"","v":"<ConeAngle>0.000000</ConeAngle>"},null,"<ConeAngle>0.000000</ConeAngle>"]
["Pitch",0,null,{"$f":"\"<\" & A1414 & \">\" & TEXT(B1414,\"0.000000\") & \"</\" & A1414 & \">\"","v":"<Pitch>0.000000</Pitch>"},null,"<Pitch>0.000000</Pitch>"]
["Sect_Parms",null,null,{"$f":"\"<\" & A1415 & \">\"","v":"<Sect_Parms>"},null,"<Sect_Parms>"]
["X_Off",0.05,null,{"$f":"\"<\" & A1416 & \">\" & TEXT(B1416,\"0.000000\") & \"</\" & A1416 & \">\"","v":"<X_Off>0.050000</X_Off>"},null,"<X_Off>0.050000</X_Off>"]
["Y_Off",0,null,{"$f":"\"<\" & A1417 & \">\" & TEXT(B1417,\"0.000000\") & \"</\" & A1417 & \">\"","v":"<Y_Off>0.000000</Y_Off>"},null,"<Y_Off>0.000000</Y_Off>"]
["Chord",0.08,null,{"$f":"\"<\" & A1418 & \">\" & TEXT(B1418,\"0.000000\") & \"</\" & A1418 & \">\"","v":"<Chord>0.080000</Chord>"},null,"<Chord>0.080000</Chord>"]
["Twist",45,null,{"$f":"\"<\" & A1419 & \">\" & TEXT(B1419,\"0.000000\") & \"</\" & A1419 & \">\"","v":"<Twist>45.000000</Twist>"},null,"<Twist>45.000000</Twist>"]
["Airfoil",null,null,{"$f":"\"<\" & A1420 & \">\"","v":"<Airfoil>"},null,"<Airfoil>"]
["Type",1,null,{"$f":"\"<\" & A1421 & \">\" & TEXT(B1421,0) & \"</\" & A1421 & \">\"","v":"<Type>1</Type>"},null,"<Type>1</Type>"]
["Inverted_Flag",0,null,{"$f":"\"<\" & A1422 & \">\" & TEXT(B1422,0) & \"</\" & A1422 & \">\"","v":"<Inverted_Flag>0</Inverted_Flag>"},null,"<Inverted_Flag>0</Inverted_Flag>"]
["Camber",0,null,{"$f":"\"<\" & A1423 & \">\" & TEXT(B1423,\"0.000000\") & \"</\" & A1423 & \">\"","v":"<Camber>0.000000</Camber>"},null,"<Camber>0.000000</Camber>"]
["Camber_Loc",0.5,null,"<Camber_Loc>0.500000</Camber_Loc>",null,"<Camber_Loc>0.500000</Camber_Loc>"]
["Thickness",0.2,null,"<Thickness>0.200000</Thickness>",null,"<Thickness>0.200000</Thickness>"]
["Thickness_Loc",0.3,null,"<Thickness_Loc>0.300000</Thickness_Loc>",null,"<Thickness_Loc>0.300000</Thickness_Loc>"]
["Radius_Le",4.4075999999999997E-2,null,"<Radius_Le>0.044076</Radius_Le>",null,"<Radius_Le>0.044076</Radius_Le>"]
["Radius_Te",0,null,"<Radius_Te>0.000000</Radius_Te>",null,"<Radius_Te>0.000000</Radius_Te>"]
["Six_Series",63,null,{"$f":"\"<\" & A1429 & \">\" & TEXT(B1429,0) & \"</\" & A1429 & \">\"","v":"<Six_Series>63</Six_Series>"},null,"<Six_Series>63</Six_Series>"]
["Ideal_Cl",0,null,{"$f":"\"<\" & A1430 & \">\" & TEXT(B1430,\"0.000000\") & \"</\" & A1430 & \">\"","v":"<Ideal_Cl>0.000000</Ideal_Cl>"},null,"<Ideal_Cl>0.000000</Ideal_Cl>"]
["A",0,null,{"$f":"\"<\" & A1431 & \">\" & TEXT(B1431,\"0.000000\") & \"</\" & A1431 & \">\"","v":"<A>0.000000</A>"},null,"<A>0.000000</A>"]
["Slat_Flag",0,null,{"$f":"\"<\" & A1432 & \">\" & TEXT(B1432,0) & \"</\" & A1432 & \">\"","v":"<Slat_Flag>0</Slat_Flag>"},null,"<Slat_Flag>0</Slat_Flag>"]
["Slat_Shear_Flag",0,null,{"$f":"\"<\" & A1433 & \">\" & TEXT(B1433,0) & \"</\" & A1433 & \">\"","v":"<Slat_Shear_Flag>0</Slat_Shear_Flag>"},null,"<Slat_Shear_Flag>0</Slat_Shear_Flag>"]
["Slat_Chord",0.25,null,{"$f":"\"<\" & A1434 & \">\" & TEXT(B1434,\"0.000000\") & \"</\" & A1434 & \">\"","v":"<Slat_Chord>0.250000</Slat_Chord>"},null,"<Slat_Chord>0.250000</Slat_Chord>"]
["Slat_Angle",10,null,{"$f":"\"<\" & A1435 & \">\" & TEXT(B1435,\"0.000000\") & \"</\" & A1435 & \">\"","v":"<Slat_Angle>10.000000</Slat_Angle>"},null,"<Slat_Angle>10.000000</Slat_Angle>"]
["Flap_Flag",0,null,{"$f":"\"<\" & A1436 & \">\" & TEXT(B1436,0) & \"</\" & A1436 & \">\"","v":"<Flap_Flag>0</Flap_Flag>"},null,"<Flap_Flag>0</Flap_Flag>"]
["Flap_Shear_Flag",0,null,{"$f":"\"<\" & A1437 & \">\" & TEXT(B1437,0) & \"</\" & A1437 & \">\"","v":"<Flap_Shear_Flag>0</Flap_Shear_Flag>"},null,"<Flap_Shear_Flag>0</Flap_Shear_Flag>"]
["Flap_Chord",0.25,null,{"$f":"\"<\" & A1438 & \">\" & TEXT(B1438,\"0.000000\") & \"</\" & A1438 & \">\"","v":"<Flap_Chord>0.250000</Flap_Chord>"},null,"<Flap_Chord>0.250000</Flap_Chord>"]
["Flap_Angle",10,null,{"$f":"\"<\" & A1439 & \">\" & TEXT(B1439,\"0.000000\") & \"</\" & A1439 & \">\"","v":"<Flap_Angle>10.000000</Flap_Angle>"},null,"<Flap_Angle>10.000000</Flap_Angle>"]
["/Airfoil",null,null,{"$f":"\"<\" & A1440 & \">\"","v":"</Airfoil>"},null,"</Airfoil>"]
["/Sect_Parms",null,null,{"$f":"\"<\" & A1441 & \">\"","v":"</Sect_Parms>"},null,"</Sect_Parms>"]
["Sect_Parms",null,null,{"$f":"\"<\" & A1442 & \">\"","v":"<Sect_Parms>"},null,"<Sect_Parms>"]
["X_Off",0.5,null,{"$f":"\"<\" & A1443 & \">\" & TEXT(B1443,\"0.000000\") & \"</\" & A1443 & \">\"","v":"<X_Off>0.500000</X_Off>"},null,"<X_Off>0.500000</X_Off>"]
["Y_Off",0,null,{"$f":"\"<\" & A1444 & \">\" & TEXT(B1444,\"0.000000\") & \"</\" & A1444 & \">\"","v":"<Y_Off>0.000000</Y_Off>"},null,"<Y_Off>0.000000</Y_Off>"]
["Chord",0.12,null,{"$f":"\"<\" & A1445 & \">\" & TEXT(B1445,\"0.000000\") & \"</\" & A1445 & \">\"","v":"<Chord>0.120000</Chord>"},null,"<Chord>0.120000</Chord>"]
["Twist",15,null,{"$f":"\"<\" & A1446 & \">\" & TEXT(B1446,\"0.000000\") & \"</\" & A1446 & \">\"","v":"<Twist>15.000000</Twist>"},null,"<Twist>15.000000</Twist>"]
["Airfoil",null,null,{"$f":"\"<\" & A1447 & \">\"","v":"<Airfoil>"},null,"<Airfoil>"]
["Type",1,null,{"$f":"\"<\" & A1448 & \">\" & TEXT(B1448,0) & \"</\" & A1448 & \">\"","v":"<Type>1</Type>"},null,"<Type>1</Type>"]
["Inverted_Flag",0,null,{"$f":"\"<\" & A1449 & \">\" & TEXT(B1449,0) & \"</\" & A1449 & \">\"","v":"<Inverted_Flag>0</Inverted_Flag>"},null,"<Inverted_Flag>0</Inverted_Flag>"]
["Camber",0,null,{"$f":"\"<\" & A1450 & \">\" & TEXT(B1450,\"0.000000\") & \"</\" & A1450 & \">\"","v":"<Camber>0.000000</Camber>"},null,"<Camber>0.000000</Camber>"]
["Camber_Loc",0.5,null,"<Camber_Loc>0.500000</Camber_Loc>",null,"<Camber_Loc>0.500000</Camber_Loc>"]
["Thickness",0.2,null,"<Thickness>0.200000</Thickness>",null,"<Thickness>0.200000</Thickness>"]
["Thickness_Loc",0.3,null,"<Thickness_Loc>0.300000</Thickness_Loc>",null,"<Thickness_Loc>0.300000</Thickness_Loc>"]
["Radius_Le",4.4075999999999997E-2,null,"<Radius_Le>0.044076</Radius_Le>",null,"<Radius_Le>0.044076</Radius_Le>"]
["Radius_Te",0,null,"<Radius_Te>0.000000</Radius_Te>",null,"<Radius_Te>0.000000</Radius_Te>"]
["Six_Series",63,null,{"$f":"\"<\" & A1456 & \">\" & TEXT(B1456,0) & \"</\" & A1456 & \">\"","v":"<Six_Series>63</Six_Series>"},null,"<Six_Series>63</Six_Series>"]
["Ideal_Cl",0,null,{"$f":"\"<\" & A1457 & \">\" & TEXT(B1457,\"0.000000\") & \"</\" & A1457 & \">\"","v":"<Ideal_Cl>0.000000</Ideal_Cl>"},null,"<Ideal_Cl>0.000000</Ideal_Cl>"]
["A",0,null,{"$f":"\"<\" & A1458 & \">\" & TEXT(B1458,\"0.000000\") & \"</\" & A1458 & \">\"","v":"<A>0.000000</A>"},null,"<A>0.000000</A>"]
["Slat_Flag",0,null,{"$f":"\"<\" & A1459 & \">\" & TEXT(B1459,0) & \"</\" & A1459 & \">\"","v":"<Slat_Flag>0</Slat_Flag>"},null,"<Slat_Flag>0</Slat_Flag>"]
["Slat_Shear_Flag",0,null,{"$f":"\"<\" & A1460 & \">\" & TEXT(B1460,0) & \"</\" & A1460 & \">\"","v":"<Slat_Shear_Flag>0</Slat_Shear_Flag>"},null,"<Slat_Shear_Flag>0</Slat_Shear_Flag>"]
["Slat_Chord",0.25,null,{"$f":"\"<\" & A1461 & \">\" & TEXT(B1461,\"0.000000\") & \"</\" & A1461 & \">\"","v":"<Slat_Chord>0.250000</Slat_Chord>"},null,"<Slat_Chord>0.250000</Slat_Chord>"]
["Slat_Angle",10,null,{"$f":"\"<\" & A1462 & \">\" & TEXT(B1462,\"0.000000\") & \"</\" & A1462 & \">\"","v":"<Slat_Angle>10.000000</Slat_Angle>"},null,"<Slat_Angle>10.000000</Slat_Angle>"]
["Flap_Flag",0,null,{"$f":"\"<\" & A1463 & \">\" & TEXT(B1463,0) & \"</\" & A1463 & \">\"","v":"<Flap_Flag>0</Flap_Flag>"},null,"<Flap_Flag>0</Flap_Flag>"]
["Flap_Shear_Flag",0,null,{"$f":"\"<\" & A1464 & \">\" & TEXT(B1464,0) & \"</\" & A1464 & \">\"","v":"<Flap_Shear_Flag>0</Flap_Shear_Flag>"},null,"<Flap_Shear_Flag>0</Flap_Shear_Flag>"]
["Flap_Chord",0.25,null,{"$f":"\"<\" & A1465 & \">\" & TEXT(B1465,\"0.000000\") & \"</\" & A1465 & \">\"","v":"<Flap_Chord>0.250000</Flap_Chord>"},null,"<Flap_Chord>0.250000</Flap_Chord>"]
["Flap_Angle",10,null,{"$f":"\"<\" & A1466 & \">\" & TEXT(B1466,\"0.000000\") & \"</\" & A1466 & \">\"","v":"<Flap_Angle>10.000000</Flap_Angle>"},null,"<Flap_Angle>10.000000</Flap_Angle>"]
["/Airfoil",null,null,{"$f":"\"<\" & A1467 & \">\"","v":"</Airfoil>"},null,"</Airfoil>"]
["/Sect_Parms",null,null,{"$f":"\"<\" & A1468 & \">\"","v":"</Sect_Parms>"},null,"</Sect_Parms>"]
["Sect_Parms",null,null,{"$f":"\"<\" & A1469 & \">\"","v":"<Sect_Parms>"},null,"<Sect_Parms>"]
["X_Off",0.9,null,{"$f":"\"<\" & A1470 & \">\" & TEXT(B1470,\"0.000000\") & \"</\" & A1470 & \">\"","v":"<X_Off>0.900000</X_Off>"},null,"<X_Off>0.900000</X_Off>"]
["Y_Off",0,null,{"$f":"\"<\" & A1471 & \">\" & TEXT(B1471,\"0.000000\") & \"</\" & A1471 & \">\"","v":"<Y_Off>0.000000</Y_Off>"},null,"<Y_Off>0.000000</Y_Off>"]
["Chord",7.0000000000000007E-2,null,{"$f":"\"<\" & A1472 & \">\" & TEXT(B1472,\"0.000000\") & \"</\" & A1472 & \">\"","v":"<Chord>0.070000</Chord>"},null,"<Chord>0.070000</Chord>"]
["Twist",5,null,{"$f":"\"<\" & A1473 & \">\" & TEXT(B1473,\"0.000000\") & \"</\" & A1473 & \">\"","v":"<Twist>5.000000</Twist>"},null,"<Twist>5.000000</Twist>"]
["Airfoil",null,null,{"$f":"\"<\" & A1474 & \">\"","v":"<Airfoil>"},null,"<Airfoil>"]
["Type",1,null,{"$f":"\"<\" & A1475 & \">\" & TEXT(B1475,0) & \"</\" & A1475 & \">\"","v":"<Type>1</Type>"},null,"<Type>1</Type>"]
["Inverted_Flag",0,null,{"$f":"\"<\" & A1476 & \">\" & TEXT(B1476,0) & \"</\" & A1476 & \">\"","v":"<Inverted_Flag>0</Inverted_Flag>"},null,"<Inverted_Flag>0</Inverted_Flag>"]
["Camber",0,null,{"$f":"\"<\" & A1477 & \">\" & TEXT(B1477,\"0.000000\") & \"</\" & A1477 & \">\"","v":"<Camber>0.000000</Camber>"},null,"<Camber>0.000000</Camber>"]
["Camber_Loc",0.5,null,"<Camber_Loc>0.500000</Camber_Loc>",null,"<Camber_Loc>0.500000</Camber_Loc>"]
["Thickness",0.2,null,"<Thickness>0.200000</Thickness>",null,"<Thickness>0.200000</Thickness>"]
["Thickness_Loc",0.3,null,"<Thickness_Loc>0.300000</Thickness_Loc>",null,"<Thickness_Loc>0.300000</Thickness_Loc>"]
["Radius_Le",4.4075999999999997E-2,null,"<Radius_Le>0.044076</Radius_Le>",null,"<Radius_Le>0.044076</Radius_Le>"]
["Radius_Te",0,null,"<Radius_Te>0.000000</Radius_Te>",null,"<Radius_Te>0.000000</Radius_Te>"]
["Six_Series",63,null,{"$f":"\"<\" & A1483 & \">\" & TEXT(B1483,0) & \"</\" & A1483 & \">\"","v":"<Six_Series>63</Six_Series>"},null,"<Six_Series>63</Six_Series>"]
["Ideal_Cl",0,null,{"$f":"\"<\" & A1484 & \">\" & TEXT(B1484,\"0.000000\") & \"</\" & A1484 & \">\"","v":"<Ideal_Cl>0.000000</Ideal_Cl>"},null,"<Ideal_Cl>0.000000</Ideal_Cl>"]
["A",0,null,{"$f":"\"<\" & A1485 & \">\" & TEXT(B1485,\"0.000000\") & \"</\" & A1485 & \">\"","v":"<A>0.000000</A>"},null,"<A>0.000000</A>"]
["Slat_Flag",0,null,{"$f":"\"<\" & A1486 & \">\" & TEXT(B1486,0) & \"</\" & A1486 & \">\"","v":"<Slat_Flag>0</Slat_Flag>"},null,"<Slat_Flag>0</Slat_Flag>"]
["Slat_Shear_Flag",0,null,{"$f":"\"<\" & A1487 & \">\" & TEXT(B1487,0) & \"</\" & A1487 & \">\"","v":"<Slat_Shear_Flag>0</Slat_Shear_Flag>"},null,"<Slat_Shear_Flag>0</Slat_Shear_Flag>"]
["Slat_Chord",0.25,null,{"$f":"\"<\" & A1488 & \">\" & TEXT(B1488,\"0.000000\") & \"</\" & A1488 & \">\"","v":"<Slat_Chord>0.250000</Slat_Chord>"},null,"<Slat_Chord>0.250000</Slat_Chord>"]
["Slat_Angle",10,null,{"$f":"\"<\" & A1489 & \">\" & TEXT(B1489,\"0.000000\") & \"</\" & A1489 & \">\"","v":"<Slat_Angle>10.000000</Slat_Angle>"},null,"<Slat_Angle>10.000000</Slat_Angle>"]
["Flap_Flag",0,null,{"$f":"\"<\" & A1490 & \">\" & TEXT(B1490,0) & \"</\" & A1490 & \">\"","v":"<Flap_Flag>0</Flap_Flag>"},null,"<Flap_Flag>0</Flap_Flag>"]
["Flap_Shear_Flag",0,null,{"$f":"\"<\" & A1491 & \">\" & TEXT(B1491,0) & \"</\" & A1491 & \">\"","v":"<Flap_Shear_Flag>0</Flap_Shear_Flag>"},null,"<Flap_Shear_Flag>0</Flap_Shear_Flag>"]
["Flap_Chord",0.25,null,{"$f":"\"<\" & A1492 & \">\" & TEXT(B1492,\"0.000000\") & \"</\" & A1492 & \">\"","v":"<Flap_Chord>0.250000</Flap_Chord>"},null,"<Flap_Chord>0.250000</Flap_Chord>"]
["Flap_Angle",10,null,{"$f":"\"<\" & A1493 & \">\" & TEXT(B1493,\"0.000000\") & \"</\" & A1493 & \">\"","v":"<Flap_Angle>10.000000</Flap_Angle>"},null,"<Flap_Angle>10.000000</Flap_Angle>"]
["/Airfoil",null,null,{"$f":"\"<\" & A1494 & \">\"","v":"</Airfoil>"},null,"</Airfoil>"]
["/Sect_Parms",null,null,{"$f":"\"<\" & A1495 & \">\"","v":"</Sect_Parms>"},null,"</Sect_Parms>"]
["Sect_Parms",null,null,{"$f":"\"<\" & A1496 & \">\"","v":"<Sect_Parms>"},null,"<Sect_Parms>"]
["X_Off",1,null,{"$f":"\"<\" & A1497 & \">\" & TEXT(B1497,\"0.000000\") & \"</\" & A1497 & \">\"","v":"<X_Off>1.000000</X_Off>"},null,"<X_Off>1.000000</X_Off>"]
["Y_Off",0,null,{"$f":"\"<\" & A1498 & \">\" & TEXT(B1498,\"0.000000\") & \"</\" & A1498 & \">\"","v":"<Y_Off>0.000000</Y_Off>"},null,"<Y_Off>0.000000</Y_Off>"]
["Chord",0.02,null,{"$f":"\"<\" & A1499 & \">\" & TEXT(B1499,\"0.000000\") & \"</\" & A1499 & \">\"","v":"<Chord>0.020000</Chord>"},null,"<Chord>0.020000</Chord>"]
["Twist",2,null,{"$f":"\"<\" & A1500 & \">\" & TEXT(B1500,\"0.000000\") & \"</\" & A1500 & \">\"","v":"<Twist>2.000000</Twist>"},null,"<Twist>2.000000</Twist>"]
["Airfoil",null,null,{"$f":"\"<\" & A1501 & \">\"","v":"<Airfoil>"},null,"<Airfoil>"]
["Type",1,null,{"$f":"\"<\" & A1502 & \">\" & TEXT(B1502,0) & \"</\" & A1502 & \">\"","v":"<Type>1</Type>"},null,"<Type>1</Type>"]
["Inverted_Flag",0,null,{"$f":"\"<\" & A1503 & \">\" & TEXT(B1503,0) & \"</\" & A1503 & \">\"","v":"<Inverted_Flag>0</Inverted_Flag>"},null,"<Inverted_Flag>0</Inverted_Flag>"]
["Camber",0,null,{"$f":"\"<\" & A1504 & \">\" & TEXT(B1504,\"0.000000\") & \"</\" & A1504 & \">\"","v":"<Camber>0.000000</Camber>"},null,"<Camber>0.000000</Camber>"]
["Camber_Loc",0.5,null,"<Camber_Loc>0.500000</Camber_Loc>",null,"<Camber_Loc>0.500000</Camber_Loc>"]
["Thickness",0.2,null,"<Thickness>0.200000</Thickness>",null,"<Thickness>0.200000</Thickness>"]
["Thickness_Loc",0.3,null,"<Thickness_Loc>0.300000</Thickness_Loc>",null,"<Thickness_Loc>0.300000</Thickness_Loc>"]
["Radius_Le",4.4075999999999997E-2,null,"<Radius_Le>0.044076</Radius_Le>",null,"<Radius_Le>0.044076</Radius_Le>"]
["Radius_Te",0,null,"<Radius_Te>0.000000</Radius_Te>",null,"<Radius_Te>0.000000</Radius_Te>"]
["Six_Series",63,null,{"$f":"\"<\" & A1510 & \">\" & TEXT(B1510,0) & \"</\" & A1510 & \">\"","v":"<Six_Series>63</Six_Series>"},null,"<Six_Series>63</Six_Series>"]
["Ideal_Cl",0,null,{"$f":"\"<\" & A1511 & \">\" & TEXT(B1511,\"0.000000\") & \"</\" & A1511 & \">\"","v":"<Ideal_Cl>0.000000</Ideal_Cl>"},null,"<Ideal_Cl>0.000000</Ideal_Cl>"]
["A",0,null,{"$f":"\"<\" & A1512 & \">\" & TEXT(B1512,\"0.000000\") & \"</\" & A1512 & \">\"","v":"<A>0.000000</A>"},null,"<A>0.000000</A>"]
["Slat_Flag",0,null,{"$f":"\"<\" & A1513 & \">\" & TEXT(B1513,0) & \"</\" & A1513 & \">\"","v":"<Slat_Flag>0</Slat_Flag>"},null,"<Slat_Flag>0</Slat_Flag>"]
["Slat_Shear_Flag",0,null,{"$f":"\"<\" & A1514 & \">\" & TEXT(B1514,0) & \"</\" & A1514 & \">\"","v":"<Slat_Shear_Flag>0</Slat_Shear_Flag>"},null,"<Slat_Shear_Flag>0</Slat_Shear_Flag>"]
["Slat_Chord",0.25,null,{"$f":"\"<\" & A1515 & \">\" & TEXT(B1515,\"0.000000\") & \"</\" & A1515 & \">\"","v":"<Slat_Chord>0.250000</Slat_Chord>"},null,"<Slat_Chord>0.250000</Slat_Chord>"]
["Slat_Angle",10,null,{"$f":"\"<\" & A1516 & \">\" & TEXT(B1516,\"0.000000\") & \"</\" & A1516 & \">\"","v":"<Slat_Angle>10.000000</Slat_Angle>"},null,"<Slat_Angle>10.000000</Slat_Angle>"]
["Flap_Flag",0,null,{"$f":"\"<\" & A1517 & \">\" & TEXT(B1517,0) & \"</\" & A1517 & \">\"","v":"<Flap_Flag>0</Flap_Flag>"},null,"<Flap_Flag>0</Flap_Flag>"]
["Flap_Shear_Flag",0,null,{"$f":"\"<\" & A1518 & \">\" & TEXT(B1518,0) & \"</\" & A1518 & \">\"","v":"<Flap_Shear_Flag>0</Flap_Shear_Flag>"},null,"<Flap_Shear_Flag>0</Flap_Shear_Flag>"]
["Flap_Chord",0.25,null,{"$f":"\"<\" & A1519 & \">\" & TEXT(B1519,\"0.000000\") & \"</\" & A1519 & \">\"","v":"<Flap_Chord>0.250000</Flap_Chord>"},null,"<Flap_Chord>0.250000</Flap_Chord>"]
["Flap_Angle",10,null,{"$f":"\"<\" & A1520 & \">\" & TEXT(B1520,\"0.000000\") & \"</\" & A1520 & \">\"","v":"<Flap_Angle>10.000000</Flap_Angle>"},null,"<Flap_Angle>10.000000</Flap_Angle>"]
["/Airfoil",null,null,{"$f":"\"<\" & A1521 & \">\"","v":"</Airfoil>"},null,"</Airfoil>"]
["/Sect_Parms",null,null,{"$f":"\"<\" & A1522 & \">\"","v":"</Sect_Parms>"},null,"</Sect_Parms>"]
["/Prop_Parms",null,null,{"$f":"\"<\" & A1523 & \">\"","v":"</Prop_Parms>"},null,"</Prop_Parms>"]
["/Component",null,{"$f":"C1357","v":"No"},{"$f":"IF(C1524=\"Yes\",(\"<\"&A1524&\">\"),(\"<\"&A1524&\"-->\"))","v":"</Component-->"},null,"</Component-->"]
["Component","Pylon",{"$f":"IF(Type_e=\"Jet\", IF(n_e = 1, \"No\", \"Yes\"),\"No\")","v":"Yes"},{"$f":"IF(C1525=\"Yes\",(\"<\"&A1525&\">\"),(\"<!--\"&A1525&\">\"))","v":"<Component>"},null,"<Component>"]
["Type","Mswing",null,{"$f":"\"<\" & A1526 & \">\" & TEXT(B1526,\"0.000000\") & \"</\" & A1526 & \">\"","v":"<Type>Mswing</Type>"},null,"<Type>Mswing</Type>"]
["General_Parms",null,null,{"$f":"\"<\" & A1527 & \">\"","v":"<General_Parms>"},null,"<General_Parms>"]
["Name","pylon",null,{"$f":"\"<\" & A1528 & \">\" & TEXT(B1528,\"0.000000\") & \"</\" & A1528 & \">\"","v":"<Name>pylon</Name>"},null,"<Name>pylon</Name>"]
["ColorR",0,null,{"$f":"\"<\" & A1529 & \">\" & TEXT(B1529,\"0.000000\") & \"</\" & A1529 & \">\"","v":"<ColorR>0.000000</ColorR>"},null,"<ColorR>0.000000</ColorR>"]
["ColorG",255,null,{"$f":"\"<\" & A1530 & \">\" & TEXT(B1530,\"0.000000\") & \"</\" & A1530 & \">\"","v":"<ColorG>255.000000</ColorG>"},null,"<ColorG>255.000000</ColorG>"]
["ColorB",0,null,{"$f":"\"<\" & A1531 & \">\" & TEXT(B1531,\"0.000000\") & \"</\" & A1531 & \">\"","v":"<ColorB>0.000000</ColorB>"},null,"<ColorB>0.000000</ColorB>"]
["Symmetry",0,null,{"$f":"\"<\" & A1532 & \">\" & TEXT(B1532,0) & \"</\" & A1532 & \">\"","v":"<Symmetry>0</Symmetry>"},null,"<Symmetry>0</Symmetry>"]
["RelXFormFlag",0,null,"<RelXFormFlag>0</RelXFormFlag>",null,"<RelXFormFlag>0</RelXFormFlag>"]
["MaterialID",2,null,"<MaterialID>2</MaterialID>",null,"<MaterialID>2</MaterialID>"]
["OutputFlag",1,null,"<OutputFlag>1</OutputFlag>",null,"<OutputFlag>1</OutputFlag>"]
["OutputNameID",0,null,"<OutputNameID>0</OutputNameID>",null,"<OutputNameID>0</OutputNameID>"]
["DisplayChildrenFlag",1,null,"<DisplayChildrenFlag>1</DisplayChildrenFlag>",null,"<DisplayChildrenFlag>1</DisplayChildrenFlag>"]
["NumPnts",21,null,"<NumPnts>21</NumPnts>",null,"<NumPnts>21</NumPnts>"]
["NumXsecs",11,null,"<NumXsecs>11</NumXsecs>",null,"<NumXsecs>11</NumXsecs>"]
["MassPrior",0,null,"<MassPrior>0</MassPrior>",null,"<MassPrior>0</MassPrior>"]
["ShellFlag",0,null,"<ShellFlag>0</ShellFlag>",null,"<ShellFlag>0</ShellFlag>"]
["Tran_X",0,null,{"$f":"\"<\" & A1542 & \">\" & TEXT(B1542,\"0.000000\") & \"</\" & A1542 & \">\"","v":"<Tran_X>0.000000</Tran_X>"},null,"<Tran_X>0.000000</Tran_X>"]
["Tran_Y",0,null,"<Tran_Y>0.000000</Tran_Y>",null,"<Tran_Y>0.000000</Tran_Y>"]
["Tran_Z",{"$f":"d_e.j/2","v":1.69},null,"<Tran_Z>1.690000</Tran_Z>",null,"<Tran_Z>0.821735</Tran_Z>"]
["TranRel_X",0,null,"<TranRel_X>0.000000</TranRel_X>",null,"<TranRel_X>0.000000</TranRel_X>"]
["TranRel_Y",0,null,"<TranRel_Y>0.000000</TranRel_Y>",null,"<TranRel_Y>0.000000</TranRel_Y>"]
["TranRel_Z",0,null,"<TranRel_Z>0.000000</TranRel_Z>",null,"<TranRel_Z>0.000000</TranRel_Z>"]
["Rot_X",90,null,"<Rot_X>90.000000</Rot_X>",null,"<Rot_X>90.000000</Rot_X>"]
["Rot_Y",0,null,"<Rot_Y>0.000000</Rot_Y>",null,"<Rot_Y>0.000000</Rot_Y>"]
["Rot_Z",0,null,"<Rot_Z>0.000000</Rot_Z>",null,"<Rot_Z>0.000000</Rot_Z>"]
["RotRel_X",0,null,"<RotRel_X>0.000000</RotRel_X>",null,"<RotRel_X>0.000000</RotRel_X>"]
["RotRel_Y",0,null,"<RotRel_Y>0.000000</RotRel_Y>",null,"<RotRel_Y>0.000000</RotRel_Y>"]
["RotRel_Z",0,null,"<RotRel_Z>0.000000</RotRel_Z>",null,"<RotRel_Z>0.000000</RotRel_Z>"]
["Origin",0,null,"<Origin>0.000000</Origin>",null,"<Origin>0.000000</Origin>"]
["Density",1,null,"<Density>1.000000</Density>",null,"<Density>1.000000</Density>"]
["ShellMassArea",1,null,"<ShellMassArea>1.000000</ShellMassArea>",null,"<ShellMassArea>1.000000</ShellMassArea>"]
["RefFlag",0,null,{"$f":"\"<\" & A1557 & \">\" & TEXT(B1557,0) & \"</\" & A1557 & \">\"","v":"<RefFlag>0</RefFlag>"},null,"<RefFlag>0</RefFlag>"]
["RefArea",100,null,{"$f":"\"<\" & A1558 & \">\" & TEXT(B1558,\"0.000000\") & \"</\" & A1558 & \">\"","v":"<RefArea>100.000000</RefArea>"},null,"<RefArea>100.000000</RefArea>"]
["RefSpan",10,null,{"$f":"\"<\" & A1559 & \">\" & TEXT(B1559,\"0.000000\") & \"</\" & A1559 & \">\"","v":"<RefSpan>10.000000</RefSpan>"},null,"<RefSpan>10.000000</RefSpan>"]
["RefCbar",1,null,{"$f":"\"<\" & A1560 & \">\" & TEXT(B1560,\"0.000000\") & \"</\" & A1560 & \">\"","v":"<RefCbar>1.000000</RefCbar>"},null,"<RefCbar>1.000000</RefCbar>"]
["AutoRefAreaFlag",1,null,{"$f":"\"<\" & A1561 & \">\" & TEXT(B1561,0) & \"</\" & A1561 & \">\"","v":"<AutoRefAreaFlag>1</AutoRefAreaFlag>"},null,"<AutoRefAreaFlag>1</AutoRefAreaFlag>"]
["AutoRefSpanFlag",1,null,{"$f":"\"<\" & A1562 & \">\" & TEXT(B1562,0) & \"</\" & A1562 & \">\"","v":"<AutoRefSpanFlag>1</AutoRefSpanFlag>"},null,"<AutoRefSpanFlag>1</AutoRefSpanFlag>"]
["AutoRefCbarFlag",1,null,{"$f":"\"<\" & A1563 & \">\" & TEXT(B1563,0) & \"</\" & A1563 & \">\"","v":"<AutoRefCbarFlag>1</AutoRefCbarFlag>"},null,"<AutoRefCbarFlag>1</AutoRefCbarFlag>"]
["AeroCenter_X",0,null,{"$f":"\"<\" & A1564 & \">\" & TEXT(B1564,\"0.000000\") & \"</\" & A1564 & \">\"","v":"<AeroCenter_X>0.000000</AeroCenter_X>"},null,"<AeroCenter_X>0.000000</AeroCenter_X>"]
["AeroCenter_Y",0,null,{"$f":"\"<\" & A1565 & \">\" & TEXT(B1565,\"0.000000\") & \"</\" & A1565 & \">\"","v":"<AeroCenter_Y>0.000000</AeroCenter_Y>"},null,"<AeroCenter_Y>0.000000</AeroCenter_Y>"]
["AeroCenter_Z",0,null,{"$f":"\"<\" & A1566 & \">\" & TEXT(B1566,\"0.000000\") & \"</\" & A1566 & \">\"","v":"<AeroCenter_Z>0.000000</AeroCenter_Z>"},null,"<AeroCenter_Z>0.000000</AeroCenter_Z>"]
["AutoAeroCenterFlag",1,null,{"$f":"\"<\" & A1567 & \">\" & TEXT(B1567,0) & \"</\" & A1567 & \">\"","v":"<AutoAeroCenterFlag>1</AutoAeroCenterFlag>"},null,"<AutoAeroCenterFlag>1</AutoAeroCenterFlag>"]
["WakeActiveFlag",0,null,{"$f":"\"<\" & A1568 & \">\" & TEXT(B1568,0) & \"</\" & A1568 & \">\"","v":"<WakeActiveFlag>0</WakeActiveFlag>"},null,"<WakeActiveFlag>0</WakeActiveFlag>"]
["PosAttachFlag",3,null,{"$f":"\"<\" & A1569 & \">\" & TEXT(B1569,0) & \"</\" & A1569 & \">\"","v":"<PosAttachFlag>3</PosAttachFlag>"},null,"<PosAttachFlag>3</PosAttachFlag>"]
["U_Attach",0,null,{"$f":"\"<\" & A1570 & \">\" & TEXT(B1570,\"0.000000\") & \"</\" & A1570 & \">\"","v":"<U_Attach>0.000000</U_Attach>"},null,"<U_Attach>0.000000</U_Attach>"]
["V_Attach",0,null,{"$f":"\"<\" & A1571 & \">\" & TEXT(B1571,\"0.000000\") & \"</\" & A1571 & \">\"","v":"<V_Attach>0.000000</V_Attach>"},null,"<V_Attach>0.000000</V_Attach>"]
["PtrID",148458296,null,{"$f":"\"<\" & A1572 & \">\" & TEXT(B1572,0) & \"</\" & A1572 & \">\"","v":"<PtrID>148458296</PtrID>"},null,"<PtrID>148458296</PtrID>"]
["Parent_PtrID",148271640,null,{"$f":"\"<\" & A1573 & \">\" & TEXT(B1573,0) & \"</\" & A1573 & \">\"","v":"<Parent_PtrID>148271640</Parent_PtrID>"},null,"<Parent_PtrID>148271640</Parent_PtrID>"]
["/General_Parms",null,null,{"$f":"\"<\" & A1574 & \">\"","v":"</General_Parms>"},null,"</General_Parms>"]
["Mswing_Parms",null,null,{"$f":"\"<\" & A1575 & \">\"","v":"<Mswing_Parms>"},null,"<Mswing_Parms>"]
["Total_Area",{"$f":"B1636","v":3.2856815572538682},null,{"$f":"\"<\" & A1576 & \">\" & TEXT(B1576,\"0.000000\") & \"</\" & A1576 & \">\"","v":"<Total_Area>3.285682</Total_Area>"},null,"<Total_Area>2.049368</Total_Area>"]
["Total_Span",{"$f":"B1637","v":0.9},null,{"$f":"\"<\" & A1577 & \">\" & TEXT(l_e.j.pylon,\"0.000000\") & \"</\" & A1577 & \">\"","v":"<Total_Span>0.900000</Total_Span>"},null,"<Total_Span>0.900000</Total_Span>"]
["Total_Proj_Span",{"$f":"B1637*COS(B1644*PI()/180)","v":0.9},null,{"$f":"\"<\" & A1578 & \">\" & TEXT(B1578,\"0.000000\") & \"</\" & A1578 & \">\"","v":"<Total_Proj_Span>0.900000</Total_Proj_Span>"},null,"<Total_Proj_Span>0.900000</Total_Proj_Span>"]
["Avg_Chord",{"$f":"B1576/l_e.j.pylon","v":3.6507572858376314},null,{"$f":"\"<\" & A1579 & \">\" & TEXT(B1579,\"0.000000\") & \"</\" & A1579 & \">\"","v":"<Avg_Chord>3.650757</Avg_Chord>"},null,"<Avg_Chord>2.277075</Avg_Chord>"]
["Sweep_Off",0,null,{"$f":"\"<\" & A1580 & \">\" & TEXT(B1580,\"0.000000\") & \"</\" & A1580 & \">\"","v":"<Sweep_Off>0.000000</Sweep_Off>"},null,"<Sweep_Off>0.000000</Sweep_Off>"]
["Deg_Per_Seg",9,null,{"$f":"\"<\" & A1581 & \">\" & TEXT(B1581,0) & \"</\" & A1581 & \">\"","v":"<Deg_Per_Seg>9</Deg_Per_Seg>"},null,"<Deg_Per_Seg>9</Deg_Per_Seg>"]
["Max_Num_Seg",9,null,{"$f":"\"<\" & A1582 & \">\" & TEXT(B1582,0) & \"</\" & A1582 & \">\"","v":"<Max_Num_Seg>9</Max_Num_Seg>"},null,"<Max_Num_Seg>9</Max_Num_Seg>"]
["Rel_Dihedral_Flag",0,null,{"$f":"\"<\" & A1583 & \">\" & TEXT(B1583,0) & \"</\" & A1583 & \">\"","v":"<Rel_Dihedral_Flag>0</Rel_Dihedral_Flag>"},null,"<Rel_Dihedral_Flag>0</Rel_Dihedral_Flag>"]
["Rel_Twist_Flag",0,null,{"$f":"\"<\" & A1584 & \">\" & TEXT(B1584,0) & \"</\" & A1584 & \">\"","v":"<Rel_Twist_Flag>0</Rel_Twist_Flag>"},null,"<Rel_Twist_Flag>0</Rel_Twist_Flag>"]
["Round_End_Cap_Flag",0,null,{"$f":"\"<\" & A1585 & \">\" & TEXT(B1585,0) & \"</\" & A1585 & \">\"","v":"<Round_End_Cap_Flag>0</Round_End_Cap_Flag>"},null,"<Round_End_Cap_Flag>0</Round_End_Cap_Flag>"]
["/Mswing_Parms",null,null,{"$f":"\"<\" & A1586 & \">\"","v":"</Mswing_Parms>"},null,"</Mswing_Parms>"]
["Airfoil_List",null,null,{"$f":"\"<\" & A1587 & \">\"","v":"<Airfoil_List>"},null,"<Airfoil_List>"]
["Airfoil","Airfoil0",null,{"$f":"\"<\" & A1588 & \">\"","v":"<Airfoil>"},null,"<Airfoil>"]
["Type",1,null,{"$f":"\"<\" & A1589 & \">\" & TEXT(B1589,0) & \"</\" & A1589 & \">\"","v":"<Type>1</Type>"},null,"<Type>1</Type>"]
["Inverted_Flag",0,null,{"$f":"\"<\" & A1590 & \">\" & TEXT(B1590,0) & \"</\" & A1590 & \">\"","v":"<Inverted_Flag>0</Inverted_Flag>"},null,"<Inverted_Flag>0</Inverted_Flag>"]
["Camber",0,null,{"$f":"\"<\" & A1591 & \">\" & TEXT(B1591,\"0.000000\") & \"</\" & A1591 & \">\"","v":"<Camber>0.000000</Camber>"},null,"<Camber>0.000000</Camber>"]
["Camber_Loc",0.5,null,"<Camber_Loc>0.500000</Camber_Loc>",null,"<Camber_Loc>0.500000</Camber_Loc>"]
["Thickness",0.08,null,"<Thickness>0.080000</Thickness>",null,"<Thickness>0.080000</Thickness>"]
["Thickness_Loc",0.3,null,"<Thickness_Loc>0.300000</Thickness_Loc>",null,"<Thickness_Loc>0.300000</Thickness_Loc>"]
["Radius_Le",7.0520000000000001E-3,null,"<Radius_Le>0.007052</Radius_Le>",null,"<Radius_Le>0.007052</Radius_Le>"]
["Radius_Te",0,null,"<Radius_Te>0.000000</Radius_Te>",null,"<Radius_Te>0.000000</Radius_Te>"]
["Six_Series",63,null,{"$f":"\"<\" & A1597 & \">\" & TEXT(B1597,0) & \"</\" & A1597 & \">\"","v":"<Six_Series>63</Six_Series>"},null,"<Six_Series>63</Six_Series>"]
["Ideal_Cl",0,null,{"$f":"\"<\" & A1598 & \">\" & TEXT(B1598,\"0.000000\") & \"</\" & A1598 & \">\"","v":"<Ideal_Cl>0.000000</Ideal_Cl>"},null,"<Ideal_Cl>0.000000</Ideal_Cl>"]
["A",0,null,{"$f":"\"<\" & A1599 & \">\" & TEXT(B1599,\"0.000000\") & \"</\" & A1599 & \">\"","v":"<A>0.000000</A>"},null,"<A>0.000000</A>"]
["Slat_Flag",0,null,{"$f":"\"<\" & A1600 & \">\" & TEXT(B1600,0) & \"</\" & A1600 & \">\"","v":"<Slat_Flag>0</Slat_Flag>"},null,"<Slat_Flag>0</Slat_Flag>"]
["Slat_Shear_Flag",0,null,{"$f":"\"<\" & A1601 & \">\" & TEXT(B1601,0) & \"</\" & A1601 & \">\"","v":"<Slat_Shear_Flag>0</Slat_Shear_Flag>"},null,"<Slat_Shear_Flag>0</Slat_Shear_Flag>"]
["Slat_Chord",0.25,null,{"$f":"\"<\" & A1602 & \">\" & TEXT(B1602,\"0.000000\") & \"</\" & A1602 & \">\"","v":"<Slat_Chord>0.250000</Slat_Chord>"},null,"<Slat_Chord>0.250000</Slat_Chord>"]
["Slat_Angle",10,null,{"$f":"\"<\" & A1603 & \">\" & TEXT(B1603,\"0.000000\") & \"</\" & A1603 & \">\"","v":"<Slat_Angle>10.000000</Slat_Angle>"},null,"<Slat_Angle>10.000000</Slat_Angle>"]
["Flap_Flag",0,null,{"$f":"\"<\" & A1604 & \">\" & TEXT(B1604,0) & \"</\" & A1604 & \">\"","v":"<Flap_Flag>0</Flap_Flag>"},null,"<Flap_Flag>0</Flap_Flag>"]
["Flap_Shear_Flag",0,null,{"$f":"\"<\" & A1605 & \">\" & TEXT(B1605,0) & \"</\" & A1605 & \">\"","v":"<Flap_Shear_Flag>0</Flap_Shear_Flag>"},null,"<Flap_Shear_Flag>0</Flap_Shear_Flag>"]
["Flap_Chord",0.25,null,{"$f":"\"<\" & A1606 & \">\" & TEXT(B1606,\"0.000000\") & \"</\" & A1606 & \">\"","v":"<Flap_Chord>0.250000</Flap_Chord>"},null,"<Flap_Chord>0.250000</Flap_Chord>"]
["Flap_Angle",10,null,{"$f":"\"<\" & A1607 & \">\" & TEXT(B1607,\"0.000000\") & \"</\" & A1607 & \">\"","v":"<Flap_Angle>10.000000</Flap_Angle>"},null,"<Flap_Angle>10.000000</Flap_Angle>"]
["/Airfoil",null,null,{"$f":"\"<\" & A1608 & \">\"","v":"</Airfoil>"},null,"</Airfoil>"]
["Airfoil","Airfoil1",null,{"$f":"\"<\" & A1609 & \">\"","v":"<Airfoil>"},null,"<Airfoil>"]
["Type",1,null,{"$f":"\"<\" & A1610 & \">\" & TEXT(B1610,0) & \"</\" & A1610 & \">\"","v":"<Type>1</Type>"},null,"<Type>1</Type>"]
["Inverted_Flag",0,null,{"$f":"\"<\" & A1611 & \">\" & TEXT(B1611,0) & \"</\" & A1611 & \">\"","v":"<Inverted_Flag>0</Inverted_Flag>"},null,"<Inverted_Flag>0</Inverted_Flag>"]
["Camber",0,null,{"$f":"\"<\" & A1612 & \">\" & TEXT(B1612,\"0.000000\") & \"</\" & A1612 & \">\"","v":"<Camber>0.000000</Camber>"},null,"<Camber>0.000000</Camber>"]
["Camber_Loc",0.5,null,"<Camber_Loc>0.500000</Camber_Loc>",null,"<Camber_Loc>0.500000</Camber_Loc>"]
["Thickness",0.08,null,"<Thickness>0.080000</Thickness>",null,"<Thickness>0.080000</Thickness>"]
["Thickness_Loc",0.3,null,"<Thickness_Loc>0.300000</Thickness_Loc>",null,"<Thickness_Loc>0.300000</Thickness_Loc>"]
["Radius_Le",7.0520000000000001E-3,null,"<Radius_Le>0.007052</Radius_Le>",null,"<Radius_Le>0.007052</Radius_Le>"]
["Radius_Te",0,null,"<Radius_Te>0.000000</Radius_Te>",null,"<Radius_Te>0.000000</Radius_Te>"]
["Six_Series",63,null,{"$f":"\"<\" & A1618 & \">\" & TEXT(B1618,0) & \"</\" & A1618 & \">\"","v":"<Six_Series>63</Six_Series>"},null,"<Six_Series>63</Six_Series>"]
["Ideal_Cl",0,null,{"$f":"\"<\" & A1619 & \">\" & TEXT(B1619,\"0.000000\") & \"</\" & A1619 & \">\"","v":"<Ideal_Cl>0.000000</Ideal_Cl>"},null,"<Ideal_Cl>0.000000</Ideal_Cl>"]
["A",0,null,{"$f":"\"<\" & A1620 & \">\" & TEXT(B1620,\"0.000000\") & \"</\" & A1620 & \">\"","v":"<A>0.000000</A>"},null,"<A>0.000000</A>"]
["Slat_Flag",0,null,{"$f":"\"<\" & A1621 & \">\" & TEXT(B1621,0) & \"</\" & A1621 & \">\"","v":"<Slat_Flag>0</Slat_Flag>"},null,"<Slat_Flag>0</Slat_Flag>"]
["Slat_Shear_Flag",0,null,{"$f":"\"<\" & A1622 & \">\" & TEXT(B1622,0) & \"</\" & A1622 & \">\"","v":"<Slat_Shear_Flag>0</Slat_Shear_Flag>"},null,"<Slat_Shear_Flag>0</Slat_Shear_Flag>"]
["Slat_Chord",0.25,null,{"$f":"\"<\" & A1623 & \">\" & TEXT(B1623,\"0.000000\") & \"</\" & A1623 & \">\"","v":"<Slat_Chord>0.250000</Slat_Chord>"},null,"<Slat_Chord>0.250000</Slat_Chord>"]
["Slat_Angle",10,null,{"$f":"\"<\" & A1624 & \">\" & TEXT(B1624,\"0.000000\") & \"</\" & A1624 & \">\"","v":"<Slat_Angle>10.000000</Slat_Angle>"},null,"<Slat_Angle>10.000000</Slat_Angle>"]
["Flap_Flag",0,null,{"$f":"\"<\" & A1625 & \">\" & TEXT(B1625,0) & \"</\" & A1625 & \">\"","v":"<Flap_Flag>0</Flap_Flag>"},null,"<Flap_Flag>0</Flap_Flag>"]
["Flap_Shear_Flag",0,null,{"$f":"\"<\" & A1626 & \">\" & TEXT(B1626,0) & \"</\" & A1626 & \">\"","v":"<Flap_Shear_Flag>0</Flap_Shear_Flag>"},null,"<Flap_Shear_Flag>0</Flap_Shear_Flag>"]
["Flap_Chord",0.25,null,{"$f":"\"<\" & A1627 & \">\" & TEXT(B1627,\"0.000000\") & \"</\" & A1627 & \">\"","v":"<Flap_Chord>0.250000</Flap_Chord>"},null,"<Flap_Chord>0.250000</Flap_Chord>"]
["Flap_Angle",10,null,{"$f":"\"<\" & A1628 & \">\" & TEXT(B1628,\"0.000000\") & \"</\" & A1628 & \">\"","v":"<Flap_Angle>10.000000</Flap_Angle>"},null,"<Flap_Angle>10.000000</Flap_Angle>"]
["/Airfoil",null,null,{"$f":"\"<\" & A1629 & \">\"","v":"</Airfoil>"},null,"</Airfoil>"]
["/Airfoil_List",null,null,{"$f":"\"<\" & A1630 & \">\"","v":"</Airfoil_List>"},null,"</Airfoil_List>"]
["Section_List",null,null,{"$f":"\"<\" & A1631 & \">\"","v":"<Section_List>"},null,"<Section_List>"]
["Section","Section0",null,{"$f":"\"<\" & A1632 & \">\"","v":"<Section>"},null,"<Section>"]
["Driver",4,null,{"$f":"\"<\" & A1633 & \">\" & TEXT(B1633,0) & \"</\" & A1633 & \">\"","v":"<Driver>4</Driver>"},null,"<Driver>4</Driver>"]
["AR",{"$f":"(B1637^2)/B1636","v":0.24652419471745399},null,{"$f":"\"<\" & A1634 & \">\" & TEXT(B1634,\"0.000000\") & \"</\" & A1634 & \">\"","v":"<AR>0.246524</AR>"},null,"<AR>0.395244</AR>"]
["TR",{"$f":"B1638/B1639","v":1},null,"<TR>1.000000</TR>",null,"<TR>1.000000</TR>"]
["Area",{"$f":"0.5*(B1638+B1639)*B1637","v":3.2856815572538682},null,"<Area>3.285682</Area>",null,"<Area>2.049368</Area>"]
["Span",0.9,null,"<Span>0.900000</Span>",null,"<Span>0.900000</Span>"]
["TC",{"$f":"0.8*IF(B1228 < b_W.i, c_r.W + B1228*(TAN(phi_100.W.i*PI()/180) - TAN(phi_0.W.i*PI()/180)), c_W.k + B1228*(TAN(phi_100.W.o*PI()/180) - TAN(phi_0.W.o*PI()/180)))","v":3.6507572858376314},null,"<TC>3.650757</TC>",null,"<TC>2.277075</TC>"]
["RC",{"$f":"B1638","v":3.6507572858376314},null,"<RC>3.650757</RC>",null,"<RC>2.277075</RC>"]
["Sweep",50,null,"<Sweep>50.000000</Sweep>",null,"<Sweep>50.000000</Sweep>"]
["SweepLoc",0,null,"<SweepLoc>0.000000</SweepLoc>",null,"<SweepLoc>0.000000</SweepLoc>"]
["Twist",0,null,"<Twist>0.000000</Twist>",null,"<Twist>0.000000</Twist>"]
["TwistLoc",0,null,"<TwistLoc>0.000000</TwistLoc>",null,"<TwistLoc>0.000000</TwistLoc>"]
["Dihedral",0,null,"<Dihedral>0.000000</Dihedral>",null,"<Dihedral>0.000000</Dihedral>"]
["Dihed_Crv1",0,null,"<Dihed_Crv1>0.000000</Dihed_Crv1>",null,"<Dihed_Crv1>0.000000</Dihed_Crv1>"]
["Dihed_Crv2",0,null,"<Dihed_Crv2>0.000000</Dihed_Crv2>",null,"<Dihed_Crv2>0.000000</Dihed_Crv2>"]
["Dihed_Crv1_Str",0.75,null,"<Dihed_Crv1_Str>0.750000</Dihed_Crv1_Str>",null,"<Dihed_Crv1_Str>0.750000</Dihed_Crv1_Str>"]
["Dihed_Crv2_Str",0.75,null,"<Dihed_Crv2_Str>0.750000</Dihed_Crv2_Str>",null,"<Dihed_Crv2_Str>0.750000</Dihed_Crv2_Str>"]
["DihedRotFlag",0,null,{"$f":"\"<\" & A1649 & \">\" & TEXT(B1649,0) & \"</\" & A1649 & \">\"","v":"<DihedRotFlag>0</DihedRotFlag>"},null,"<DihedRotFlag>0</DihedRotFlag>"]
["SmoothBlendFlag",0,null,{"$f":"\"<\" & A1650 & \">\" & TEXT(B1650,0) & \"</\" & A1650 & \">\"","v":"<SmoothBlendFlag>0</SmoothBlendFlag>"},null,"<SmoothBlendFlag>0</SmoothBlendFlag>"]
["NumInterpXsecs",1,null,{"$f":"\"<\" & A1651 & \">\" & TEXT(B1651,0) & \"</\" & A1651 & \">\"","v":"<NumInterpXsecs>1</NumInterpXsecs>"},null,"<NumInterpXsecs>1</NumInterpXsecs>"]
["/Section",null,null,{"$f":"\"<\" & A1652 & \">\"","v":"</Section>"},null,"</Section>"]
["/Section_List",null,null,{"$f":"\"<\" & A1653 & \">\"","v":"</Section_List>"},null,"</Section_List>"]
["/Component",null,{"$f":"C1525","v":"Yes"},{"$f":"IF(C1654=\"Yes\",(\"<\"&A1654&\">\"),(\"<\"&A1654&\"-->\"))","v":"</Component>"},null,"</Component>"]
["Component","FanSect",{"$f":"IF(AND(C1210=\"Yes\",C1357=\"Yes\"),\"No\",\"Yes\")","v":"Yes"},{"$f":"IF(C1655=\"Yes\",(\"<\"&A1655&\">\"),(\"<!--\"&A1655&\">\"))","v":"<Component>"},null,"<Component>"]
["Type","Engine",null,{"$f":"\"<\" & A1656 & \">\" & TEXT(B1656,\"0.000000\") & \"</\" & A1656 & \">\"","v":"<Type>Engine</Type>"},null,"<Type>Engine</Type>"]
["General_Parms",null,null,{"$f":"\"<\" & A1657 & \">\"","v":"<General_Parms>"},null,"<General_Parms>"]
["Name","fan_section",null,{"$f":"\"<\" & A1658 & \">\" & TEXT(B1658,\"0.000000\") & \"</\" & A1658 & \">\"","v":"<Name>fan_section</Name>"},null,"<Name>fan_section</Name>"]
["ColorR",0,null,{"$f":"\"<\" & A1659 & \">\" & TEXT(B1659,\"0.000000\") & \"</\" & A1659 & \">\"","v":"<ColorR>0.000000</ColorR>"},null,"<ColorR>0.000000</ColorR>"]
["ColorG",0,null,{"$f":"\"<\" & A1660 & \">\" & TEXT(B1660,\"0.000000\") & \"</\" & A1660 & \">\"","v":"<ColorG>0.000000</ColorG>"},null,"<ColorG>0.000000</ColorG>"]
["ColorB",255,null,{"$f":"\"<\" & A1661 & \">\" & TEXT(B1661,\"0.000000\") & \"</\" & A1661 & \">\"","v":"<ColorB>255.000000</ColorB>"},null,"<ColorB>255.000000</ColorB>"]
["Symmetry",0,null,{"$f":"\"<\" & A1662 & \">\" & TEXT(B1662,0) & \"</\" & A1662 & \">\"","v":"<Symmetry>0</Symmetry>"},null,"<Symmetry>0</Symmetry>"]
["RelXFormFlag",0,null,"<RelXFormFlag>0</RelXFormFlag>",null,"<RelXFormFlag>0</RelXFormFlag>"]
["MaterialID",2,null,"<MaterialID>2</MaterialID>",null,"<MaterialID>2</MaterialID>"]
["OutputFlag",1,null,"<OutputFlag>1</OutputFlag>",null,"<OutputFlag>1</OutputFlag>"]
["OutputNameID",0,null,"<OutputNameID>0</OutputNameID>",null,"<OutputNameID>0</OutputNameID>"]
["DisplayChildrenFlag",1,null,"<DisplayChildrenFlag>1</DisplayChildrenFlag>",null,"<DisplayChildrenFlag>1</DisplayChildrenFlag>"]
["NumPnts",21,null,"<NumPnts>21</NumPnts>",null,"<NumPnts>21</NumPnts>"]
["NumXsecs",11,null,"<NumXsecs>11</NumXsecs>",null,"<NumXsecs>11</NumXsecs>"]
["MassPrior",0,null,"<MassPrior>0</MassPrior>",null,"<MassPrior>0</MassPrior>"]
["ShellFlag",0,null,"<ShellFlag>0</ShellFlag>",null,"<ShellFlag>0</ShellFlag>"]
["Tran_X",0,null,{"$f":"\"<\" & A1672 & \">\" & TEXT(B1672,\"0.000000\") & \"</\" & A1672 & \">\"","v":"<Tran_X>0.000000</Tran_X>"},null,"<Tran_X>0.000000</Tran_X>"]
["Tran_Y",0,null,"<Tran_Y>0.000000</Tran_Y>",null,"<Tran_Y>0.000000</Tran_Y>"]
["Tran_Z",0,null,"<Tran_Z>0.000000</Tran_Z>",null,"<Tran_Z>0.000000</Tran_Z>"]
["TranRel_X",0,null,"<TranRel_X>0.000000</TranRel_X>",null,"<TranRel_X>0.000000</TranRel_X>"]
["TranRel_Y",0,null,"<TranRel_Y>0.000000</TranRel_Y>",null,"<TranRel_Y>0.000000</TranRel_Y>"]
["TranRel_Z",0,null,"<TranRel_Z>0.000000</TranRel_Z>",null,"<TranRel_Z>0.000000</TranRel_Z>"]
["Rot_X",0,null,"<Rot_X>0.000000</Rot_X>",null,"<Rot_X>0.000000</Rot_X>"]
["Rot_Y",0,null,"<Rot_Y>0.000000</Rot_Y>",null,"<Rot_Y>0.000000</Rot_Y>"]
["Rot_Z",0,null,"<Rot_Z>0.000000</Rot_Z>",null,"<Rot_Z>0.000000</Rot_Z>"]
["RotRel_X",0,null,"<RotRel_X>0.000000</RotRel_X>",null,"<RotRel_X>0.000000</RotRel_X>"]
["RotRel_Y",0,null,"<RotRel_Y>0.000000</RotRel_Y>",null,"<RotRel_Y>0.000000</RotRel_Y>"]
["RotRel_Z",0,null,"<RotRel_Z>0.000000</RotRel_Z>",null,"<RotRel_Z>0.000000</RotRel_Z>"]
["Origin",0,null,"<Origin>0.000000</Origin>",null,"<Origin>0.000000</Origin>"]
["Density",1,null,"<Density>1.000000</Density>",null,"<Density>1.000000</Density>"]
["ShellMassArea",1,null,"<ShellMassArea>1.000000</ShellMassArea>",null,"<ShellMassArea>1.000000</ShellMassArea>"]
["RefFlag",0,null,{"$f":"\"<\" & A1687 & \">\" & TEXT(B1687,0) & \"</\" & A1687 & \">\"","v":"<RefFlag>0</RefFlag>"},null,"<RefFlag>0</RefFlag>"]
["RefArea",100,null,{"$f":"\"<\" & A1688 & \">\" & TEXT(B1688,\"0.000000\") & \"</\" & A1688 & \">\"","v":"<RefArea>100.000000</RefArea>"},null,"<RefArea>100.000000</RefArea>"]
["RefSpan",10,null,{"$f":"\"<\" & A1689 & \">\" & TEXT(B1689,\"0.000000\") & \"</\" & A1689 & \">\"","v":"<RefSpan>10.000000</RefSpan>"},null,"<RefSpan>10.000000</RefSpan>"]
["RefCbar",1,null,{"$f":"\"<\" & A1690 & \">\" & TEXT(B1690,\"0.000000\") & \"</\" & A1690 & \">\"","v":"<RefCbar>1.000000</RefCbar>"},null,"<RefCbar>1.000000</RefCbar>"]
["AutoRefAreaFlag",1,null,{"$f":"\"<\" & A1691 & \">\" & TEXT(B1691,0) & \"</\" & A1691 & \">\"","v":"<AutoRefAreaFlag>1</AutoRefAreaFlag>"},null,"<AutoRefAreaFlag>1</AutoRefAreaFlag>"]
["AutoRefSpanFlag",1,null,{"$f":"\"<\" & A1692 & \">\" & TEXT(B1692,0) & \"</\" & A1692 & \">\"","v":"<AutoRefSpanFlag>1</AutoRefSpanFlag>"},null,"<AutoRefSpanFlag>1</AutoRefSpanFlag>"]
["AutoRefCbarFlag",1,null,{"$f":"\"<\" & A1693 & \">\" & TEXT(B1693,0) & \"</\" & A1693 & \">\"","v":"<AutoRefCbarFlag>1</AutoRefCbarFlag>"},null,"<AutoRefCbarFlag>1</AutoRefCbarFlag>"]
["AeroCenter_X",0,null,{"$f":"\"<\" & A1694 & \">\" & TEXT(B1694,\"0.000000\") & \"</\" & A1694 & \">\"","v":"<AeroCenter_X>0.000000</AeroCenter_X>"},null,"<AeroCenter_X>0.000000</AeroCenter_X>"]
["AeroCenter_Y",0,null,{"$f":"\"<\" & A1695 & \">\" & TEXT(B1695,\"0.000000\") & \"</\" & A1695 & \">\"","v":"<AeroCenter_Y>0.000000</AeroCenter_Y>"},null,"<AeroCenter_Y>0.000000</AeroCenter_Y>"]
["AeroCenter_Z",0,null,{"$f":"\"<\" & A1696 & \">\" & TEXT(B1696,\"0.000000\") & \"</\" & A1696 & \">\"","v":"<AeroCenter_Z>0.000000</AeroCenter_Z>"},null,"<AeroCenter_Z>0.000000</AeroCenter_Z>"]
["AutoAeroCenterFlag",1,null,{"$f":"\"<\" & A1697 & \">\" & TEXT(B1697,0) & \"</\" & A1697 & \">\"","v":"<AutoAeroCenterFlag>1</AutoAeroCenterFlag>"},null,"<AutoAeroCenterFlag>1</AutoAeroCenterFlag>"]
["WakeActiveFlag",0,null,{"$f":"\"<\" & A1698 & \">\" & TEXT(B1698,0) & \"</\" & A1698 & \">\"","v":"<WakeActiveFlag>0</WakeActiveFlag>"},null,"<WakeActiveFlag>0</WakeActiveFlag>"]
["PosAttachFlag",3,null,{"$f":"\"<\" & A1699 & \">\" & TEXT(B1699,0) & \"</\" & A1699 & \">\"","v":"<PosAttachFlag>3</PosAttachFlag>"},null,"<PosAttachFlag>3</PosAttachFlag>"]
["U_Attach",0,null,{"$f":"\"<\" & A1700 & \">\" & TEXT(B1700,\"0.000000\") & \"</\" & A1700 & \">\"","v":"<U_Attach>0.000000</U_Attach>"},null,"<U_Attach>0.000000</U_Attach>"]
["V_Attach",0,null,{"$f":"\"<\" & A1701 & \">\" & TEXT(B1701,\"0.000000\") & \"</\" & A1701 & \">\"","v":"<V_Attach>0.000000</V_Attach>"},null,"<V_Attach>0.000000</V_Attach>"]
["PtrID",148485072,null,{"$f":"\"<\" & A1702 & \">\" & TEXT(B1702,0) & \"</\" & A1702 & \">\"","v":"<PtrID>148485072</PtrID>"},null,"<PtrID>148485072</PtrID>"]
["Parent_PtrID",148271640,null,{"$f":"\"<\" & A1703 & \">\" & TEXT(B1703,0) & \"</\" & A1703 & \">\"","v":"<Parent_PtrID>148271640</Parent_PtrID>"},null,"<Parent_PtrID>148271640</Parent_PtrID>"]
["/General_Parms",null,null,{"$f":"\"<\" & A1704 & \">\"","v":"</General_Parms>"},null,"</General_Parms>"]
["Engine_Parms",null,null,{"$f":"\"<\" & A1705 & \">\"","v":"<Engine_Parms>"},null,"<Engine_Parms>"]
["Engine_Type",0,null,{"$f":"\"<\" & A1706 & \">\" & TEXT(B1706,0) & \"</\" & A1706 & \">\"","v":"<Engine_Type>0</Engine_Type>"},null,"<Engine_Type>0</Engine_Type>"]
["Radius_Tip",{"$f":"0.5*d_e.j","v":1.69},null,{"$f":"\"<\" & A1707 & \">\" & TEXT(B1707,\"0.000000\") & \"</\" & A1707 & \">\"","v":"<Radius_Tip>1.690000</Radius_Tip>"},null,"<Radius_Tip>0.821735</Radius_Tip>"]
["Max_Tip",1.1499999999999999,null,{"$f":"\"<\" & A1708 & \">\" & TEXT(B1708,\"0.000000\") & \"</\" & A1708 & \">\"","v":"<Max_Tip>1.150000</Max_Tip>"},null,"<Max_Tip>1.150000</Max_Tip>"]
["Hub_Tip",0.31333299999999997,null,{"$f":"\"<\" & A1709 & \">\" & TEXT(B1709,\"0.000000\") & \"</\" & A1709 & \">\"","v":"<Hub_Tip>0.313333</Hub_Tip>"},null,"<Hub_Tip>0.313333</Hub_Tip>"]
["Eng_Length",0,null,{"$f":"\"<\" & A1710 & \">\" & TEXT(B1710,\"0.000000\") & \"</\" & A1710 & \">\"","v":"<Eng_Length>0.000000</Eng_Length>"},null,"<Eng_Length>0.000000</Eng_Length>"]
["Inlet_Type",1,null,{"$f":"\"<\" & A1711 & \">\" & TEXT(B1711,0) & \"</\" & A1711 & \">\"","v":"<Inlet_Type>1</Inlet_Type>"},null,"<Inlet_Type>1</Inlet_Type>"]
["Inl_Noz_Color",0,null,{"$f":"\"<\" & A1712 & \">\" & TEXT(B1712,0) & \"</\" & A1712 & \">\"","v":"<Inl_Noz_Color>0</Inl_Noz_Color>"},null,"<Inl_Noz_Color>0</Inl_Noz_Color>"]
["Inlet_XY_Sym_Flag",0,null,{"$f":"\"<\" & A1713 & \">\" & TEXT(B1713,0) & \"</\" & A1713 & \">\"","v":"<Inlet_XY_Sym_Flag>0</Inlet_XY_Sym_Flag>"},null,"<Inlet_XY_Sym_Flag>0</Inlet_XY_Sym_Flag>"]
["Inlet_Half_Split_Flag",0,null,{"$f":"\"<\" & A1714 & \">\" & TEXT(B1714,0) & \"</\" & A1714 & \">\"","v":"<Inlet_Half_Split_Flag>0</Inlet_Half_Split_Flag>"},null,"<Inlet_Half_Split_Flag>0</Inlet_Half_Split_Flag>"]
["Cowl_Length",{"$f":"0.5*l_e.j/B1707","v":1.3726875000000003},null,{"$f":"\"<\" & A1715 & \">\" & TEXT(B1715,\"0.000000\") & \"</\" & A1715 & \">\"","v":"<Cowl_Length>1.372688</Cowl_Length>"},null,"<Cowl_Length>1.824696</Cowl_Length>"]
["Eng_Thrt_Ratio",1.1499999999999999,null,"<Eng_Thrt_Ratio>1.150000</Eng_Thrt_Ratio>",null,"<Eng_Thrt_Ratio>1.150000</Eng_Thrt_Ratio>"]
["Hilight_Thrt_Ratio",1.1499999999999999,null,"<Hilight_Thrt_Ratio>1.150000</Hilight_Thrt_Ratio>",null,"<Hilight_Thrt_Ratio>1.150000</Hilight_Thrt_Ratio>"]
["Lip_Finess_Ratio",1.026904,null,"<Lip_Finess_Ratio>1.026904</Lip_Finess_Ratio>",null,"<Lip_Finess_Ratio>1.026904</Lip_Finess_Ratio>"]
["Height_Width_Ratio",1,null,"<Height_Width_Ratio>1.000000</Height_Width_Ratio>",null,"<Height_Width_Ratio>1.000000</Height_Width_Ratio>"]
["Upper_Surf_Shape_Factor",-0.95229299999999995,null,"<Upper_Surf_Shape_Factor>-0.952293</Upper_Surf_Shape_Factor>",null,"<Upper_Surf_Shape_Factor>-0.952293</Upper_Surf_Shape_Factor>"]
["Lower_Surf_Shape_Factor",0.66507400000000005,null,"<Lower_Surf_Shape_Factor>0.665074</Lower_Surf_Shape_Factor>",null,"<Lower_Surf_Shape_Factor>0.665074</Lower_Surf_Shape_Factor>"]
["Inlet_X_Axis_Rot",90,null,"<Inlet_X_Axis_Rot>90.000000</Inlet_X_Axis_Rot>",null,"<Inlet_X_Axis_Rot>90.000000</Inlet_X_Axis_Rot>"]
["Inlet_Scarf_Angle",2,null,"<Inlet_Scarf_Angle>2.000000</Inlet_Scarf_Angle>",null,"<Inlet_Scarf_Angle>2.000000</Inlet_Scarf_Angle>"]
["Inlet_Duct_On_Off",0,null,{"$f":"\"<\" & A1724 & \">\" & TEXT(B1724,0) & \"</\" & A1724 & \">\"","v":"<Inlet_Duct_On_Off>0</Inlet_Duct_On_Off>"},null,"<Inlet_Duct_On_Off>0</Inlet_Duct_On_Off>"]
["Inlet_Duct_X_Offset",3,null,{"$f":"\"<\" & A1725 & \">\" & TEXT(B1725,\"0.000000\") & \"</\" & A1725 & \">\"","v":"<Inlet_Duct_X_Offset>3.000000</Inlet_Duct_X_Offset>"},null,"<Inlet_Duct_X_Offset>3.000000</Inlet_Duct_X_Offset>"]
["Inlet_Duct_Y_Offset",1,null,{"$f":"\"<\" & A1726 & \">\" & TEXT(B1726,\"0.000000\") & \"</\" & A1726 & \">\"","v":"<Inlet_Duct_Y_Offset>1.000000</Inlet_Duct_Y_Offset>"},null,"<Inlet_Duct_Y_Offset>1.000000</Inlet_Duct_Y_Offset>"]
["Inlet_Duct_Shape_Factor",0.5,null,{"$f":"\"<\" & A1727 & \">\" & TEXT(B1727,\"0.000000\") & \"</\" & A1727 & \">\"","v":"<Inlet_Duct_Shape_Factor>0.500000</Inlet_Duct_Shape_Factor>"},null,"<Inlet_Duct_Shape_Factor>0.500000</Inlet_Duct_Shape_Factor>"]
["Divertor_On_Off",0,null,{"$f":"\"<\" & A1728 & \">\" & TEXT(B1728,0) & \"</\" & A1728 & \">\"","v":"<Divertor_On_Off>0</Divertor_On_Off>"},null,"<Divertor_On_Off>0</Divertor_On_Off>"]
["Divertor_Height",0.5,null,{"$f":"\"<\" & A1729 & \">\" & TEXT(B1729,\"0.000000\") & \"</\" & A1729 & \">\"","v":"<Divertor_Height>0.500000</Divertor_Height>"},null,"<Divertor_Height>0.500000</Divertor_Height>"]
["Divertor_Length",1,null,{"$f":"\"<\" & A1730 & \">\" & TEXT(B1730,\"0.000000\") & \"</\" & A1730 & \">\"","v":"<Divertor_Length>1.000000</Divertor_Length>"},null,"<Divertor_Length>1.000000</Divertor_Length>"]
["Nozzle_Type",0,null,{"$f":"\"<\" & A1731 & \">\" & TEXT(B1731,0) & \"</\" & A1731 & \">\"","v":"<Nozzle_Type>0</Nozzle_Type>"},null,"<Nozzle_Type>0</Nozzle_Type>"]
["Nozzle_Length",{"$f":"IF(n_e = 1, (((cowl_cover)/100)*(B1346*B1321) + c_r.V)/B1707, ((cowl_cover)/100)*(B1346*B1321)/B1707)","v":1.3726875000000003},null,{"$f":"\"<\" & A1732 & \">\" & TEXT(B1732,\"0.000000\") & \"</\" & A1732 & \">\"","v":"<Nozzle_Length>1.372688</Nozzle_Length>"},null,"<Nozzle_Length>1.824696</Nozzle_Length>"]
["Exit_Area_Ratio",1.2,null,{"$f":"\"<\" & A1733 & \">\" & TEXT(B1733,\"0.000000\") & \"</\" & A1733 & \">\"","v":"<Exit_Area_Ratio>1.200000</Exit_Area_Ratio>"},null,"<Exit_Area_Ratio>1.200000</Exit_Area_Ratio>"]
["Nozzle_Height_Width_Ratio",1,null,{"$f":"\"<\" & A1734 & \">\" & TEXT(B1734,\"0.000000\") & \"</\" & A1734 & \">\"","v":"<Nozzle_Height_Width_Ratio>1.000000</Nozzle_Height_Width_Ratio>"},null,"<Nozzle_Height_Width_Ratio>1.000000</Nozzle_Height_Width_Ratio>"]
["Exit_Throat_Ratio",1.5,null,{"$f":"\"<\" & A1735 & \">\" & TEXT(B1735,\"0.000000\") & \"</\" & A1735 & \">\"","v":"<Exit_Throat_Ratio>1.500000</Exit_Throat_Ratio>"},null,"<Exit_Throat_Ratio>1.500000</Exit_Throat_Ratio>"]
["Dive_Flap_Ratio",1,null,{"$f":"\"<\" & A1736 & \">\" & TEXT(B1736,\"0.000000\") & \"</\" & A1736 & \">\"","v":"<Dive_Flap_Ratio>1.000000</Dive_Flap_Ratio>"},null,"<Dive_Flap_Ratio>1.000000</Dive_Flap_Ratio>"]
["Nozzle_Duct_On_Off",0,null,{"$f":"\"<\" & A1737 & \">\" & TEXT(B1737,0) & \"</\" & A1737 & \">\"","v":"<Nozzle_Duct_On_Off>0</Nozzle_Duct_On_Off>"},null,"<Nozzle_Duct_On_Off>0</Nozzle_Duct_On_Off>"]
["Nozzle_Duct_X_Offset",1,null,{"$f":"\"<\" & A1738 & \">\" & TEXT(B1738,\"0.000000\") & \"</\" & A1738 & \">\"","v":"<Nozzle_Duct_X_Offset>1.000000</Nozzle_Duct_X_Offset>"},null,"<Nozzle_Duct_X_Offset>1.000000</Nozzle_Duct_X_Offset>"]
["Nozzle_Duct_Y_Offset",0,null,{"$f":"\"<\" & A1739 & \">\" & TEXT(B1739,\"0.000000\") & \"</\" & A1739 & \">\"","v":"<Nozzle_Duct_Y_Offset>0.000000</Nozzle_Duct_Y_Offset>"},null,"<Nozzle_Duct_Y_Offset>0.000000</Nozzle_Duct_Y_Offset>"]
["Nozzle_Duct_Shape_Factor",0,null,{"$f":"\"<\" & A1740 & \">\" & TEXT(B1740,\"0.000000\") & \"</\" & A1740 & \">\"","v":"<Nozzle_Duct_Shape_Factor>0.000000</Nozzle_Duct_Shape_Factor>"},null,"<Nozzle_Duct_Shape_Factor>0.000000</Nozzle_Duct_Shape_Factor>"]
["/Engine_Parms",null,null,{"$f":"\"<\" & A1741 & \">\"","v":"</Engine_Parms>"}]
["/Component",null,{"$f":"IF(OR(C1357=\"Yes\",C1210=\"No\"),\"No\",\"Yes\")","v":"Yes"},{"$f":"IF(C1742=\"Yes\",(\"<\"&A1742&\">\"),(\"<\"&A1742&\"-->\"))","v":"</Component>"}]
["Component",{"$f":"B1746","v":"Engine 1"},{"$f":"IF(Input!$D$27>=2,\"Yes\",\"No\")","v":"Yes"},{"$f":"IF(C1743=\"Yes\",(\"<\"&A1743&\">\"),(\"<!--\"&A1743&\">\"))","v":"<Component>"}]
["Type","Blank",null,{"$f":"\"<\" & A1744 & \">\" & TEXT(B1744,0) & \"</\" & A1744 & \">\"","v":"<Type>Blank</Type>"}]
["General_Parms",null,null,{"$f":"\"<\" & A1745 & \">\"","v":"<General_Parms>"}]
["Name",{"$f":"IF(OR(n_e=2,n_e=3),\"Engine 1\",\"Engine 2\")","v":"Engine 1"},null,{"$f":"\"<\" & A1746 & \">\" & TEXT(B1746,0) & \"</\" & A1746 & \">\"","v":"<Name>Engine 1</Name>"}]
["ColorR",0,null,{"$f":"\"<\" & A1747 & \">\" & TEXT(B1747,\"0.000000\") & \"</\" & A1747 & \">\"","v":"<ColorR>0.000000</ColorR>"}]
["ColorG",0,null,{"$f":"\"<\" & A1748 & \">\" & TEXT(B1748,\"0.000000\") & \"</\" & A1748 & \">\"","v":"<ColorG>0.000000</ColorG>"}]
["ColorB",255,null,{"$f":"\"<\" & A1749 & \">\" & TEXT(B1749,\"0.000000\") & \"</\" & A1749 & \">\"","v":"<ColorB>255.000000</ColorB>"}]
["Symmetry",0,null,{"$f":"\"<\" & A1750 & \">\" & TEXT(B1750,0) & \"</\" & A1750 & \">\"","v":"<Symmetry>0</Symmetry>"}]
["RelXFormFlag",0,null,"<RelXFormFlag>0</RelXFormFlag>"]
["MaterialID",2,null,"<MaterialID>2</MaterialID>"]
["OutputFlag",1,null,"<OutputFlag>1</OutputFlag>"]
["OutputNameID",0,null,"<OutputNameID>0</OutputNameID>"]
["DisplayChildrenFlag",1,null,"<DisplayChildrenFlag>1</DisplayChildrenFlag>"]
["NumPnts",21,null,"<NumPnts>21</NumPnts>"]
["NumXsecs",11,null,"<NumXsecs>11</NumXsecs>"]
["MassPrior",0,null,"<MassPrior>0</MassPrior>"]
["ShellFlag",0,null,"<ShellFlag>0</ShellFlag>"]
["Tran_X",{"$f":"IF(Type_e=\"Jet\",pos_e.j2.x,pos_e.p2.x)","v":23.193146602423081},null,{"$f":"\"<\" & A1760 & \">\" & TEXT(B1760,\"0.000000\") & \"</\" & A1760 & \">\"","v":"<Tran_X>23.193147</Tran_X>"}]
["Tran_Y",{"$f":"IF(Type_e=\"Jet\",pos_e.j2.y,pos_e.p2.y)","v":-9.8231687912404322},null,"<Tran_Y>-9.823169</Tran_Y>"]
["Tran_Z",{"$f":"IF(Type_e=\"Jet\",pos_e.j2.z,pos_e.p2.z)","v":-3.1710555412855181},null,"<Tran_Z>-3.171056</Tran_Z>"]
["TranRel_X",0,null,"<TranRel_X>0.000000</TranRel_X>"]
["TranRel_Y",0,null,"<TranRel_Y>0.000000</TranRel_Y>"]
["TranRel_Z",0,null,"<TranRel_Z>0.000000</TranRel_Z>"]
["Rot_X",0,null,"<Rot_X>0.000000</Rot_X>"]
["Rot_Y",0,null,"<Rot_Y>0.000000</Rot_Y>"]
["Rot_Z",0,null,"<Rot_Z>0.000000</Rot_Z>"]
["RotRel_X",0,null,"<RotRel_X>0.000000</RotRel_X>"]
["RotRel_Y",0,null,"<RotRel_Y>0.000000</RotRel_Y>"]
["RotRel_Z",0,null,"<RotRel_Z>0.000000</RotRel_Z>"]
["Origin",0,null,"<Origin>0.000000</Origin>"]
["Density",1,null,"<Density>1.000000</Density>"]
["ShellMassArea",1,null,"<ShellMassArea>1.000000</ShellMassArea>"]
["RefFlag",0,null,{"$f":"\"<\" & A1775 & \">\" & TEXT(B1775,0) & \"</\" & A1775 & \">\"","v":"<RefFlag>0</RefFlag>"}]
["RefArea",100,null,{"$f":"\"<\" & A1776 & \">\" & TEXT(B1776,\"0.000000\") & \"</\" & A1776 & \">\"","v":"<RefArea>100.000000</RefArea>"}]
["RefSpan",10,null,{"$f":"\"<\" & A1777 & \">\" & TEXT(B1777,\"0.000000\") & \"</\" & A1777 & \">\"","v":"<RefSpan>10.000000</RefSpan>"}]
["RefCbar",1,null,{"$f":"\"<\" & A1778 & \">\" & TEXT(B1778,\"0.000000\") & \"</\" & A1778 & \">\"","v":"<RefCbar>1.000000</RefCbar>"}]
["AutoRefAreaFlag",1,null,{"$f":"\"<\" & A1779 & \">\" & TEXT(B1779,0) & \"</\" & A1779 & \">\"","v":"<AutoRefAreaFlag>1</AutoRefAreaFlag>"}]
["AutoRefSpanFlag",1,null,{"$f":"\"<\" & A1780 & \">\" & TEXT(B1780,0) & \"</\" & A1780 & \">\"","v":"<AutoRefSpanFlag>1</AutoRefSpanFlag>"}]
["AutoRefCbarFlag",1,null,{"$f":"\"<\" & A1781 & \">\" & TEXT(B1781,0) & \"</\" & A1781 & \">\"","v":"<AutoRefCbarFlag>1</AutoRefCbarFlag>"}]
["AeroCenter_X",0,null,{"$f":"\"<\" & A1782 & \">\" & TEXT(B1782,\"0.000000\") & \"</\" & A1782 & \">\"","v":"<AeroCenter_X>0.000000</AeroCenter_X>"}]
["AeroCenter_Y",0,null,{"$f":"\"<\" & A1783 & \">\" & TEXT(B1783,\"0.000000\") & \"</\" & A1783 & \">\"","v":"<AeroCenter_Y>0.000000</AeroCenter_Y>"}]
["AeroCenter_Z",0,null,{"$f":"\"<\" & A1784 & \">\" & TEXT(B1784,\"0.000000\") & \"</\" & A1784 & \">\"","v":"<AeroCenter_Z>0.000000</AeroCenter_Z>"}]
["AutoAeroCenterFlag",1,null,{"$f":"\"<\" & A1785 & \">\" & TEXT(B1785,0) & \"</\" & A1785 & \">\"","v":"<AutoAeroCenterFlag>1</AutoAeroCenterFlag>"}]
["WakeActiveFlag",0,null,{"$f":"\"<\" & A1786 & \">\" & TEXT(B1786,0) & \"</\" & A1786 & \">\"","v":"<WakeActiveFlag>0</WakeActiveFlag>"}]
["PosAttachFlag",0,null,{"$f":"\"<\" & A1787 & \">\" & TEXT(B1787,0) & \"</\" & A1787 & \">\"","v":"<PosAttachFlag>0</PosAttachFlag>"}]
["U_Attach",0,null,{"$f":"\"<\" & A1788 & \">\" & TEXT(B1788,\"0.000000\") & \"</\" & A1788 & \">\"","v":"<U_Attach>0.000000</U_Attach>"}]
["V_Attach",0,null,{"$f":"\"<\" & A1789 & \">\" & TEXT(B1789,\"0.000000\") & \"</\" & A1789 & \">\"","v":"<V_Attach>0.000000</V_Attach>"}]
["PtrID",148674848,null,{"$f":"\"<\" & A1790 & \">\" & TEXT(B1790,0) & \"</\" & A1790 & \">\"","v":"<PtrID>148674848</PtrID>"}]
["Parent_PtrID",0,null,"<Parent_PtrID>0</Parent_PtrID>"]
["Children_PtrID",148677432,null,"<Children_PtrID>148677432</Children_PtrID>"]
["Children_PtrID",148906600,null,"<Children_PtrID>148906600</Children_PtrID>"]
["Children_PtrID",148458297,null,"<Children_PtrID>148458297</Children_PtrID>"]
["Children_PtrID",426023,null,"<Children_PtrID>426023</Children_PtrID>"]
["/General_Parms",null,null,{"$f":"\"<\" & A1796 & \">\"","v":"</General_Parms>"}]
["Blank_Parms",null,null,{"$f":"\"<\" & A1797 & \">\"","v":"<Blank_Parms>"}]
["PointMassFlag",0,null,{"$f":"\"<\" & A1798 & \">\" & TEXT(B1798,0) & \"</\" & A1798 & \">\"","v":"<PointMassFlag>0</PointMassFlag>"}]
["PointMass",1,null,{"$f":"\"<\" & A1799 & \">\" & TEXT(B1799,\"0.000000\") & \"</\" & A1799 & \">\"","v":"<PointMass>1.000000</PointMass>"}]
["/Blank_Parms",null,null,{"$f":"\"<\" & A1800 & \">\"","v":"</Blank_Parms>"}]
["/Component",null,null,{"$f":"\"<\" & A1801 & \">\"","v":"</Component>"}]
["Component","CoreSect",null,{"$f":"\"<\" & A1802 & \">\"","v":"<Component>"}]
["Type",{"$f":"B1270","v":"Engine"},null,{"$f":"\"<\" & A1803 & \">\" & TEXT(B1803,\"0.000000\") & \"</\" & A1803 & \">\"","v":"<Type>Engine</Type>"}]
["General_Parms",null,null,{"$f":"\"<\" & A1804 & \">\"","v":"<General_Parms>"}]
["Name",{"$f":"B1272","v":"core_section"},null,{"$f":"\"<\" & A1805 & \">\" & TEXT(B1805,\"0.000000\") & \"</\" & A1805 & \">\"","v":"<Name>core_section</Name>"}]
["ColorR",{"$f":"B1273","v":0},null,{"$f":"\"<\" & A1806 & \">\" & TEXT(B1806,\"0.000000\") & \"</\" & A1806 & \">\"","v":"<ColorR>0.000000</ColorR>"}]
["ColorG",0,null,{"$f":"\"<\" & A1807 & \">\" & TEXT(B1807,\"0.000000\") & \"</\" & A1807 & \">\"","v":"<ColorG>0.000000</ColorG>"}]
["ColorB",0,null,{"$f":"\"<\" & A1808 & \">\" & TEXT(B1808,\"0.000000\") & \"</\" & A1808 & \">\"","v":"<ColorB>0.000000</ColorB>"}]
["Symmetry",0,null,{"$f":"\"<\" & A1809 & \">\" & TEXT(B1809,0) & \"</\" & A1809 & \">\"","v":"<Symmetry>0</Symmetry>"}]
["RelXFormFlag",0,null,"<RelXFormFlag>0</RelXFormFlag>"]
["MaterialID",2,null,"<MaterialID>2</MaterialID>"]
["OutputFlag",1,null,"<OutputFlag>1</OutputFlag>"]
["OutputNameID",0,null,"<OutputNameID>0</OutputNameID>"]
["DisplayChildrenFlag",1,null,"<DisplayChildrenFlag>1</DisplayChildrenFlag>"]
["NumPnts",21,null,"<NumPnts>21</NumPnts>"]
["NumXsecs",11,null,"<NumXsecs>11</NumXsecs>"]
["MassPrior",0,null,"<MassPrior>0</MassPrior>"]
["ShellFlag",0,null,"<ShellFlag>0</ShellFlag>"]
["Tran_X",0,null,{"$f":"\"<\" & A1819 & \">\" & TEXT(B1819,\"0.000000\") & \"</\" & A1819 & \">\"","v":"<Tran_X>0.000000</Tran_X>"}]
["Tran_Y",0,null,"<Tran_Y>0.000000</Tran_Y>"]
["Tran_Z",0,null,"<Tran_Z>0.000000</Tran_Z>"]
["TranRel_X",0,null,"<TranRel_X>0.000000</TranRel_X>"]
["TranRel_Y",0,null,"<TranRel_Y>0.000000</TranRel_Y>"]
["TranRel_Z",0,null,"<TranRel_Z>0.000000</TranRel_Z>"]
["Rot_X",0,null,"<Rot_X>0.000000</Rot_X>"]
["Rot_Y",0,null,"<Rot_Y>0.000000</Rot_Y>"]
["Rot_Z",0,null,"<Rot_Z>0.000000</Rot_Z>"]
["RotRel_X",0,null,"<RotRel_X>0.000000</RotRel_X>"]
["RotRel_Y",0,null,"<RotRel_Y>0.000000</RotRel_Y>"]
["RotRel_Z",0,null,"<RotRel_Z>0.000000</RotRel_Z>"]
["Origin",0,null,"<Origin>0.000000</Origin>"]
["Density",1,null,"<Density>1.000000</Density>"]
["ShellMassArea",1,null,"<ShellMassArea>1.000000</ShellMassArea>"]
["RefFlag",0,null,{"$f":"\"<\" & A1834 & \">\" & TEXT(B1834,0) & \"</\" & A1834 & \">\"","v":"<RefFlag>0</RefFlag>"}]
["RefArea",100,null,{"$f":"\"<\" & A1835 & \">\" & TEXT(B1835,\"0.000000\") & \"</\" & A1835 & \">\"","v":"<RefArea>100.000000</RefArea>"}]
["RefSpan",10,null,{"$f":"\"<\" & A1836 & \">\" & TEXT(B1836,\"0.000000\") & \"</\" & A1836 & \">\"","v":"<RefSpan>10.000000</RefSpan>"}]
["RefCbar",1,null,{"$f":"\"<\" & A1837 & \">\" & TEXT(B1837,\"0.000000\") & \"</\" & A1837 & \">\"","v":"<RefCbar>1.000000</RefCbar>"}]
["AutoRefAreaFlag",1,null,{"$f":"\"<\" & A1838 & \">\" & TEXT(B1838,0) & \"</\" & A1838 & \">\"","v":"<AutoRefAreaFlag>1</AutoRefAreaFlag>"}]
["AutoRefSpanFlag",{"$f":"B1306","v":1},null,{"$f":"\"<\" & A1839 & \">\" & TEXT(B1839,0) & \"</\" & A1839 & \">\"","v":"<AutoRefSpanFlag>1</AutoRefSpanFlag>"}]
["AutoRefCbarFlag",1,null,{"$f":"\"<\" & A1840 & \">\" & TEXT(B1840,0) & \"</\" & A1840 & \">\"","v":"<AutoRefCbarFlag>1</AutoRefCbarFlag>"}]
["AeroCenter_X",0,null,{"$f":"\"<\" & A1841 & \">\" & TEXT(B1841,\"0.000000\") & \"</\" & A1841 & \">\"","v":"<AeroCenter_X>0.000000</AeroCenter_X>"}]
["AeroCenter_Y",0,null,{"$f":"\"<\" & A1842 & \">\" & TEXT(B1842,\"0.000000\") & \"</\" & A1842 & \">\"","v":"<AeroCenter_Y>0.000000</AeroCenter_Y>"}]
["AeroCenter_Z",0,null,{"$f":"\"<\" & A1843 & \">\" & TEXT(B1843,\"0.000000\") & \"</\" & A1843 & \">\"","v":"<AeroCenter_Z>0.000000</AeroCenter_Z>"}]
["AutoAeroCenterFlag",1,null,{"$f":"\"<\" & A1844 & \">\" & TEXT(B1844,0) & \"</\" & A1844 & \">\"","v":"<AutoAeroCenterFlag>1</AutoAeroCenterFlag>"}]
["WakeActiveFlag",0,null,{"$f":"\"<\" & A1845 & \">\" & TEXT(B1845,0) & \"</\" & A1845 & \">\"","v":"<WakeActiveFlag>0</WakeActiveFlag>"}]
["PosAttachFlag",3,null,{"$f":"\"<\" & A1846 & \">\" & TEXT(B1846,0) & \"</\" & A1846 & \">\"","v":"<PosAttachFlag>3</PosAttachFlag>"}]
["U_Attach",0,null,{"$f":"\"<\" & A1847 & \">\" & TEXT(B1847,\"0.000000\") & \"</\" & A1847 & \">\"","v":"<U_Attach>0.000000</U_Attach>"}]
["V_Attach",0,null,{"$f":"\"<\" & A1848 & \">\" & TEXT(B1848,\"0.000000\") & \"</\" & A1848 & \">\"","v":"<V_Attach>0.000000</V_Attach>"}]
["PtrID",148677432,null,{"$f":"\"<\" & A1849 & \">\" & TEXT(B1849,0) & \"</\" & A1849 & \">\"","v":"<PtrID>148677432</PtrID>"}]
["Parent_PtrID",148674848,null,{"$f":"\"<\" & A1850 & \">\" & TEXT(B1850,0) & \"</\" & A1850 & \">\"","v":"<Parent_PtrID>148674848</Parent_PtrID>"}]
["/General_Parms",null,null,{"$f":"\"<\" & A1851 & \">\"","v":"</General_Parms>"}]
["Engine_Parms",null,null,{"$f":"\"<\" & A1852 & \">\"","v":"<Engine_Parms>"}]
["Engine_Type",{"$f":"B1320","v":0},null,{"$f":"\"<\" & A1853 & \">\" & TEXT(B1853,0) & \"</\" & A1853 & \">\"","v":"<Engine_Type>0</Engine_Type>"}]
["Radius_Tip",0.84499999999999997,null,{"$f":"\"<\" & A1854 & \">\" & TEXT(B1854,\"0.000000\") & \"</\" & A1854 & \">\"","v":"<Radius_Tip>0.845000</Radius_Tip>"}]
["Max_Tip",1.3,null,{"$f":"\"<\" & A1855 & \">\" & TEXT(B1855,\"0.000000\") & \"</\" & A1855 & \">\"","v":"<Max_Tip>1.300000</Max_Tip>"}]
["Hub_Tip",0.5,null,{"$f":"\"<\" & A1856 & \">\" & TEXT(B1856,\"0.000000\") & \"</\" & A1856 & \">\"","v":"<Hub_Tip>0.500000</Hub_Tip>"}]
["Eng_Length",0,null,{"$f":"\"<\" & A1857 & \">\" & TEXT(B1857,\"0.000000\") & \"</\" & A1857 & \">\"","v":"<Eng_Length>0.000000</Eng_Length>"}]
["Inlet_Type",1,null,{"$f":"\"<\" & A1858 & \">\" & TEXT(B1858,0) & \"</\" & A1858 & \">\"","v":"<Inlet_Type>1</Inlet_Type>"}]
["Inl_Noz_Color",0,null,{"$f":"\"<\" & A1859 & \">\" & TEXT(B1859,0) & \"</\" & A1859 & \">\"","v":"<Inl_Noz_Color>0</Inl_Noz_Color>"}]
["Inlet_XY_Sym_Flag",0,null,{"$f":"\"<\" & A1860 & \">\" & TEXT(B1860,0) & \"</\" & A1860 & \">\"","v":"<Inlet_XY_Sym_Flag>0</Inlet_XY_Sym_Flag>"}]
["Inlet_Half_Split_Flag",0,null,{"$f":"\"<\" & A1861 & \">\" & TEXT(B1861,0) & \"</\" & A1861 & \">\"","v":"<Inlet_Half_Split_Flag>0</Inlet_Half_Split_Flag>"}]
["Cowl_Length",1E-3,null,{"$f":"\"<\" & A1862 & \">\" & TEXT(B1862,\"0.000000\") & \"</\" & A1862 & \">\"","v":"<Cowl_Length>0.001000</Cowl_Length>"}]
["Eng_Thrt_Ratio",1.5,null,"<Eng_Thrt_Ratio>1.500000</Eng_Thrt_Ratio>"]
["Hilight_Thrt_Ratio",1.3,null,"<Hilight_Thrt_Ratio>1.300000</Hilight_Thrt_Ratio>"]
["Lip_Finess_Ratio",1.9,null,"<Lip_Finess_Ratio>1.900000</Lip_Finess_Ratio>"]
["Height_Width_Ratio",1,null,"<Height_Width_Ratio>1.000000</Height_Width_Ratio>"]
["Upper_Surf_Shape_Factor",-1.3,null,"<Upper_Surf_Shape_Factor>-1.300000</Upper_Surf_Shape_Factor>"]
["Lower_Surf_Shape_Factor",0.7,null,"<Lower_Surf_Shape_Factor>0.700000</Lower_Surf_Shape_Factor>"]
["Inlet_X_Axis_Rot",0,null,"<Inlet_X_Axis_Rot>0.000000</Inlet_X_Axis_Rot>"]
["Inlet_Scarf_Angle",0,null,"<Inlet_Scarf_Angle>0.000000</Inlet_Scarf_Angle>"]
["Inlet_Duct_On_Off",0,null,{"$f":"\"<\" & A1871 & \">\" & TEXT(B1871,0) & \"</\" & A1871 & \">\"","v":"<Inlet_Duct_On_Off>0</Inlet_Duct_On_Off>"}]
["Inlet_Duct_X_Offset",3,null,{"$f":"\"<\" & A1872 & \">\" & TEXT(B1872,\"0.000000\") & \"</\" & A1872 & \">\"","v":"<Inlet_Duct_X_Offset>3.000000</Inlet_Duct_X_Offset>"}]
["Inlet_Duct_Y_Offset",1,null,{"$f":"\"<\" & A1873 & \">\" & TEXT(B1873,\"0.000000\") & \"</\" & A1873 & \">\"","v":"<Inlet_Duct_Y_Offset>1.000000</Inlet_Duct_Y_Offset>"}]
["Inlet_Duct_Shape_Factor",0.5,null,{"$f":"\"<\" & A1874 & \">\" & TEXT(B1874,\"0.000000\") & \"</\" & A1874 & \">\"","v":"<Inlet_Duct_Shape_Factor>0.500000</Inlet_Duct_Shape_Factor>"}]
["Divertor_On_Off",0,null,{"$f":"\"<\" & A1875 & \">\" & TEXT(B1875,0) & \"</\" & A1875 & \">\"","v":"<Divertor_On_Off>0</Divertor_On_Off>"}]
["Divertor_Height",0.5,null,{"$f":"\"<\" & A1876 & \">\" & TEXT(B1876,\"0.000000\") & \"</\" & A1876 & \">\"","v":"<Divertor_Height>0.500000</Divertor_Height>"}]
["Divertor_Length",1,null,{"$f":"\"<\" & A1877 & \">\" & TEXT(B1877,\"0.000000\") & \"</\" & A1877 & \">\"","v":"<Divertor_Length>1.000000</Divertor_Length>"}]
["Nozzle_Type",0,null,{"$f":"\"<\" & A1878 & \">\" & TEXT(B1878,0) & \"</\" & A1878 & \">\"","v":"<Nozzle_Type>0</Nozzle_Type>"}]
["Nozzle_Length",5.4907500000000011,null,{"$f":"\"<\" & A1879 & \">\" & TEXT(B1879,\"0.000000\") & \"</\" & A1879 & \">\"","v":"<Nozzle_Length>5.490750</Nozzle_Length>"}]
["Exit_Area_Ratio",3,null,{"$f":"\"<\" & A1880 & \">\" & TEXT(B1880,\"0.000000\") & \"</\" & A1880 & \">\"","v":"<Exit_Area_Ratio>3.000000</Exit_Area_Ratio>"}]
["Nozzle_Height_Width_Ratio",1,null,{"$f":"\"<\" & A1881 & \">\" & TEXT(B1881,\"0.000000\") & \"</\" & A1881 & \">\"","v":"<Nozzle_Height_Width_Ratio>1.000000</Nozzle_Height_Width_Ratio>"}]
["Exit_Throat_Ratio",1.5,null,{"$f":"\"<\" & A1882 & \">\" & TEXT(B1882,\"0.000000\") & \"</\" & A1882 & \">\"","v":"<Exit_Throat_Ratio>1.500000</Exit_Throat_Ratio>"}]
["Dive_Flap_Ratio",1,null,{"$f":"\"<\" & A1883 & \">\" & TEXT(B1883,\"0.000000\") & \"</\" & A1883 & \">\"","v":"<Dive_Flap_Ratio>1.000000</Dive_Flap_Ratio>"}]
["Nozzle_Duct_On_Off",0,null,{"$f":"\"<\" & A1884 & \">\" & TEXT(B1884,0) & \"</\" & A1884 & \">\"","v":"<Nozzle_Duct_On_Off>0</Nozzle_Duct_On_Off>"}]
["Nozzle_Duct_X_Offset",1,null,{"$f":"\"<\" & A1885 & \">\" & TEXT(B1885,\"0.000000\") & \"</\" & A1885 & \">\"","v":"<Nozzle_Duct_X_Offset>1.000000</Nozzle_Duct_X_Offset>"}]
["Nozzle_Duct_Y_Offset",0,null,{"$f":"\"<\" & A1886 & \">\" & TEXT(B1886,\"0.000000\") & \"</\" & A1886 & \">\"","v":"<Nozzle_Duct_Y_Offset>0.000000</Nozzle_Duct_Y_Offset>"}]
["Nozzle_Duct_Shape_Factor",0,null,{"$f":"\"<\" & A1887 & \">\" & TEXT(B1887,\"0.000000\") & \"</\" & A1887 & \">\"","v":"<Nozzle_Duct_Shape_Factor>0.000000</Nozzle_Duct_Shape_Factor>"}]
["/Engine_Parms",null,null,{"$f":"\"<\" & A1888 & \">\"","v":"</Engine_Parms>"}]
["/Component",null,null,{"$f":"\"<\" & A1889 & \">\"","v":"</Component>"}]
["Component","Prop Rotor",{"$f":"IF(Input!D27>=2,IF(Input!$D$26=\"Jet\",\"No\",\"Yes\"),\"Yes\")","v":"No"},{"$f":"IF(C1890=\"Yes\",(\"<\"&A1890&\">\"),(\"<!--\"&A1890&\">\"))","v":"<!--Component>"}]
["Type","Prop",null,{"$f":"\"<\" & A1891 & \">\" & TEXT(B1891,\"0.000000\") & \"</\" & A1891 & \">\"","v":"<Type>Prop</Type>"}]
["General_Parms",null,null,{"$f":"\"<\" & A1892 & \">\"","v":"<General_Parms>"}]
["Name",{"$f":"B1360","v":"Rotor"},null,{"$f":"\"<\" & A1893 & \">\" & TEXT(B1893,\"0.000000\") & \"</\" & A1893 & \">\"","v":"<Name>Rotor</Name>"}]
["ColorR",127,null,{"$f":"\"<\" & A1894 & \">\" & TEXT(B1894,\"0.000000\") & \"</\" & A1894 & \">\"","v":"<ColorR>127.000000</ColorR>"}]
["ColorG",127,null,{"$f":"\"<\" & A1895 & \">\" & TEXT(B1895,\"0.000000\") & \"</\" & A1895 & \">\"","v":"<ColorG>127.000000</ColorG>"},null,null,null,null,null,null,null,null,null,"</Name>"]
["ColorB",127,null,{"$f":"\"<\" & A1896 & \">\" & TEXT(B1896,\"0.000000\") & \"</\" & A1896 & \">\"","v":"<ColorB>127.000000</ColorB>"}]
["Symmetry",0,null,{"$f":"\"<\" & A1897 & \">\" & TEXT(B1897,0) & \"</\" & A1897 & \">\"","v":"<Symmetry>0</Symmetry>"}]
["RelXFormFlag",0,null,"<RelXFormFlag>0</RelXFormFlag>"]
["MaterialID",0,null,"<MaterialID>0</MaterialID>"]
["OutputFlag",1,null,"<OutputFlag>1</OutputFlag>"]
["OutputNameID",0,null,"<OutputNameID>0</OutputNameID>"]
["DisplayChildrenFlag",1,null,"<DisplayChildrenFlag>1</DisplayChildrenFlag>"]
["NumPnts",21,null,"<NumPnts>21</NumPnts>"]
["NumXsecs",11,null,"<NumXsecs>11</NumXsecs>"]
["MassPrior",0,null,"<MassPrior>0</MassPrior>"]
["ShellFlag",0,null,"<ShellFlag>0</ShellFlag>"]
["Tran_X",0,null,{"$f":"\"<\" & A1907 & \">\" & TEXT(B1907,\"0.000000\") & \"</\" & A1907 & \">\"","v":"<Tran_X>0.000000</Tran_X>"}]
["Tran_Y",0,null,"<Tran_Y>0.000000</Tran_Y>"]
["Tran_Z",0,null,"<Tran_Z>0.000000</Tran_Z>"]
["TranRel_X",0,null,"<TranRel_X>0.000000</TranRel_X>"]
["TranRel_Y",0,null,"<TranRel_Y>0.000000</TranRel_Y>"]
["TranRel_Z",0,null,"<TranRel_Z>0.000000</TranRel_Z>"]
["Rot_X",0,null,"<Rot_X>0.000000</Rot_X>"]
["Rot_Y",0,null,"<Rot_Y>0.000000</Rot_Y>"]
["Rot_Z",0,null,"<Rot_Z>0.000000</Rot_Z>"]
["RotRel_X",0,null,"<RotRel_X>0.000000</RotRel_X>"]
["RotRel_Y",0,null,"<RotRel_Y>0.000000</RotRel_Y>"]
["RotRel_Z",0,null,"<RotRel_Z>0.000000</RotRel_Z>"]
["Origin",0,null,"<Origin>0.000000</Origin>"]
["Density",1,null,"<Density>1.000000</Density>"]
["ShellMassArea",1,null,"<ShellMassArea>1.000000</ShellMassArea>"]
["RefFlag",0,null,{"$f":"\"<\" & A1922 & \">\" & TEXT(B1922,0) & \"</\" & A1922 & \">\"","v":"<RefFlag>0</RefFlag>"}]
["RefArea",100,null,{"$f":"\"<\" & A1923 & \">\" & TEXT(B1923,\"0.000000\") & \"</\" & A1923 & \">\"","v":"<RefArea>100.000000</RefArea>"}]
["RefSpan",10,null,{"$f":"\"<\" & A1924 & \">\" & TEXT(B1924,\"0.000000\") & \"</\" & A1924 & \">\"","v":"<RefSpan>10.000000</RefSpan>"}]
["RefCbar",1,null,{"$f":"\"<\" & A1925 & \">\" & TEXT(B1925,\"0.000000\") & \"</\" & A1925 & \">\"","v":"<RefCbar>1.000000</RefCbar>"}]
["AutoRefAreaFlag",1,null,{"$f":"\"<\" & A1926 & \">\" & TEXT(B1926,0) & \"</\" & A1926 & \">\"","v":"<AutoRefAreaFlag>1</AutoRefAreaFlag>"}]
["AutoRefSpanFlag",1,null,{"$f":"\"<\" & A1927 & \">\" & TEXT(B1927,0) & \"</\" & A1927 & \">\"","v":"<AutoRefSpanFlag>1</AutoRefSpanFlag>"}]
["AutoRefCbarFlag",1,null,{"$f":"\"<\" & A1928 & \">\" & TEXT(B1928,0) & \"</\" & A1928 & \">\"","v":"<AutoRefCbarFlag>1</AutoRefCbarFlag>"}]
["AeroCenter_X",0,null,{"$f":"\"<\" & A1929 & \">\" & TEXT(B1929,\"0.000000\") & \"</\" & A1929 & \">\"","v":"<AeroCenter_X>0.000000</AeroCenter_X>"}]
["AeroCenter_Y",0,null,{"$f":"\"<\" & A1930 & \">\" & TEXT(B1930,\"0.000000\") & \"</\" & A1930 & \">\"","v":"<AeroCenter_Y>0.000000</AeroCenter_Y>"}]
["AeroCenter_Z",0,null,{"$f":"\"<\" & A1931 & \">\" & TEXT(B1931,\"0.000000\") & \"</\" & A1931 & \">\"","v":"<AeroCenter_Z>0.000000</AeroCenter_Z>"}]
["AutoAeroCenterFlag",1,null,{"$f":"\"<\" & A1932 & \">\" & TEXT(B1932,0) & \"</\" & A1932 & \">\"","v":"<AutoAeroCenterFlag>1</AutoAeroCenterFlag>"}]
["WakeActiveFlag",0,null,{"$f":"\"<\" & A1933 & \">\" & TEXT(B1933,0) & \"</\" & A1933 & \">\"","v":"<WakeActiveFlag>0</WakeActiveFlag>"}]
["PosAttachFlag",3,null,{"$f":"\"<\" & A1934 & \">\" & TEXT(B1934,0) & \"</\" & A1934 & \">\"","v":"<PosAttachFlag>3</PosAttachFlag>"}]
["U_Attach",0,null,{"$f":"\"<\" & A1935 & \">\" & TEXT(B1935,\"0.000000\") & \"</\" & A1935 & \">\"","v":"<U_Attach>0.000000</U_Attach>"}]
["V_Attach",0,null,{"$f":"\"<\" & A1936 & \">\" & TEXT(B1936,\"0.000000\") & \"</\" & A1936 & \">\"","v":"<V_Attach>0.000000</V_Attach>"}]
["PtrID",426023,null,{"$f":"\"<\" & A1937 & \">\" & TEXT(B1937,0) & \"</\" & A1937 & \">\"","v":"<PtrID>426023</PtrID>"}]
["Parent_PtrID",148674848,null,{"$f":"\"<\" & A1938 & \">\" & TEXT(B1938,0) & \"</\" & A1938 & \">\"","v":"<Parent_PtrID>148674848</Parent_PtrID>"}]
["/General_Parms",null,null,{"$f":"\"<\" & A1939 & \">\"","v":"</General_Parms>"}]
["Prop_Parms",null,null,{"$f":"\"<\" & A1940 & \">\"","v":"<Prop_Parms>"}]
["NumBlades",{"$f":"B1408","v":6},null,{"$f":"\"<\" & A1941 & \">\" & TEXT(B1941,0) & \"</\" & A1941 & \">\"","v":"<NumBlades>6</NumBlades>"}]
["SmoothFlag",1,null,{"$f":"\"<\" & A1942 & \">\" & TEXT(B1942,0) & \"</\" & A1942 & \">\"","v":"<SmoothFlag>1</SmoothFlag>"}]
["NumU",3,null,{"$f":"\"<\" & A1943 & \">\" & TEXT(B1943,0) & \"</\" & A1943 & \">\"","v":"<NumU>3</NumU>"}]
["NumW",1,null,{"$f":"\"<\" & A1944 & \">\" & TEXT(B1944,0) & \"</\" & A1944 & \">\"","v":"<NumW>1</NumW>"}]
["Diameter",3.8910028638910115,null,{"$f":"\"<\" & A1945 & \">\" & TEXT(B1945,\"0.000000\") & \"</\" & A1945 & \">\"","v":"<Diameter>3.891003</Diameter>"}]
["ConeAngle",0,null,{"$f":"\"<\" & A1946 & \">\" & TEXT(B1946,\"0.000000\") & \"</\" & A1946 & \">\"","v":"<ConeAngle>0.000000</ConeAngle>"}]
["Pitch",0,null,{"$f":"\"<\" & A1947 & \">\" & TEXT(B1947,\"0.000000\") & \"</\" & A1947 & \">\"","v":"<Pitch>0.000000</Pitch>"}]
["Sect_Parms","Section0",null,{"$f":"\"<\" & A1948 & \">\"","v":"<Sect_Parms>"}]
["X_Off",0.05,null,{"$f":"\"<\" & A1949 & \">\" & TEXT(B1949,\"0.000000\") & \"</\" & A1949 & \">\"","v":"<X_Off>0.050000</X_Off>"}]
["Y_Off",0,null,{"$f":"\"<\" & A1950 & \">\" & TEXT(B1950,\"0.000000\") & \"</\" & A1950 & \">\"","v":"<Y_Off>0.000000</Y_Off>"}]
["Chord",0.08,null,{"$f":"\"<\" & A1951 & \">\" & TEXT(B1951,\"0.000000\") & \"</\" & A1951 & \">\"","v":"<Chord>0.080000</Chord>"}]
["Twist",45,null,{"$f":"\"<\" & A1952 & \">\" & TEXT(B1952,\"0.000000\") & \"</\" & A1952 & \">\"","v":"<Twist>45.000000</Twist>"}]
["Airfoil",null,null,{"$f":"\"<\" & A1953 & \">\"","v":"<Airfoil>"}]
["Type",1,null,{"$f":"\"<\" & A1954 & \">\" & TEXT(B1954,0) & \"</\" & A1954 & \">\"","v":"<Type>1</Type>"}]
["Inverted_Flag",0,null,{"$f":"\"<\" & A1955 & \">\" & TEXT(B1955,0) & \"</\" & A1955 & \">\"","v":"<Inverted_Flag>0</Inverted_Flag>"}]
["Camber",0,null,{"$f":"\"<\" & A1956 & \">\" & TEXT(B1956,\"0.000000\") & \"</\" & A1956 & \">\"","v":"<Camber>0.000000</Camber>"}]
["Camber_Loc",0.5,null,"<Camber_Loc>0.500000</Camber_Loc>"]
["Thickness",0.2,null,"<Thickness>0.200000</Thickness>"]
["Thickness_Loc",0.3,null,"<Thickness_Loc>0.300000</Thickness_Loc>"]
["Radius_Le",4.4075999999999997E-2,null,"<Radius_Le>0.044076</Radius_Le>"]
["Radius_Te",0,null,"<Radius_Te>0.000000</Radius_Te>"]
["Six_Series",63,null,{"$f":"\"<\" & A1962 & \">\" & TEXT(B1962,0) & \"</\" & A1962 & \">\"","v":"<Six_Series>63</Six_Series>"}]
["Ideal_Cl",0,null,{"$f":"\"<\" & A1963 & \">\" & TEXT(B1963,\"0.000000\") & \"</\" & A1963 & \">\"","v":"<Ideal_Cl>0.000000</Ideal_Cl>"}]
["A",0,null,{"$f":"\"<\" & A1964 & \">\" & TEXT(B1964,\"0.000000\") & \"</\" & A1964 & \">\"","v":"<A>0.000000</A>"}]
["Slat_Flag",0,null,{"$f":"\"<\" & A1965 & \">\" & TEXT(B1965,0) & \"</\" & A1965 & \">\"","v":"<Slat_Flag>0</Slat_Flag>"}]
["Slat_Shear_Flag",0,null,{"$f":"\"<\" & A1966 & \">\" & TEXT(B1966,0) & \"</\" & A1966 & \">\"","v":"<Slat_Shear_Flag>0</Slat_Shear_Flag>"}]
["Slat_Chord",0.25,null,{"$f":"\"<\" & A1967 & \">\" & TEXT(B1967,\"0.000000\") & \"</\" & A1967 & \">\"","v":"<Slat_Chord>0.250000</Slat_Chord>"}]
["Slat_Angle",10,null,{"$f":"\"<\" & A1968 & \">\" & TEXT(B1968,\"0.000000\") & \"</\" & A1968 & \">\"","v":"<Slat_Angle>10.000000</Slat_Angle>"}]
["Flap_Flag",0,null,{"$f":"\"<\" & A1969 & \">\" & TEXT(B1969,0) & \"</\" & A1969 & \">\"","v":"<Flap_Flag>0</Flap_Flag>"}]
["Flap_Shear_Flag",0,null,{"$f":"\"<\" & A1970 & \">\" & TEXT(B1970,0) & \"</\" & A1970 & \">\"","v":"<Flap_Shear_Flag>0</Flap_Shear_Flag>"}]
["Flap_Chord",0.25,null,{"$f":"\"<\" & A1971 & \">\" & TEXT(B1971,\"0.000000\") & \"</\" & A1971 & \">\"","v":"<Flap_Chord>0.250000</Flap_Chord>"}]
["Flap_Angle",10,null,{"$f":"\"<\" & A1972 & \">\" & TEXT(B1972,\"0.000000\") & \"</\" & A1972 & \">\"","v":"<Flap_Angle>10.000000</Flap_Angle>"}]
["/Airfoil",null,null,{"$f":"\"<\" & A1973 & \">\"","v":"</Airfoil>"}]
["/Sect_Parms",null,null,{"$f":"\"<\" & A1974 & \">\"","v":"</Sect_Parms>"}]
["Sect_Parms","Section1",null,{"$f":"\"<\" & A1975 & \">\"","v":"<Sect_Parms>"}]
["X_Off",{"$f":"B1443","v":0.5},null,{"$f":"\"<\" & A1976 & \">\" & TEXT(B1976,\"0.000000\") & \"</\" & A1976 & \">\"","v":"<X_Off>0.500000</X_Off>"}]
["Y_Off",{"$f":"B1444","v":0},null,{"$f":"\"<\" & A1977 & \">\" & TEXT(B1977,\"0.000000\") & \"</\" & A1977 & \">\"","v":"<Y_Off>0.000000</Y_Off>"}]
["Chord",{"$f":"B1445","v":0.12},null,{"$f":"\"<\" & A1978 & \">\" & TEXT(B1978,\"0.000000\") & \"</\" & A1978 & \">\"","v":"<Chord>0.120000</Chord>"}]
["Twist",{"$f":"B1446","v":15},null,{"$f":"\"<\" & A1979 & \">\" & TEXT(B1979,\"0.000000\") & \"</\" & A1979 & \">\"","v":"<Twist>15.000000</Twist>"}]
["Airfoil",null,null,{"$f":"\"<\" & A1980 & \">\"","v":"<Airfoil>"}]
["Type",{"$f":"B1448","v":1},null,{"$f":"\"<\" & A1981 & \">\" & TEXT(B1981,0) & \"</\" & A1981 & \">\"","v":"<Type>1</Type>"}]
["Inverted_Flag",0,null,{"$f":"\"<\" & A1982 & \">\" & TEXT(B1982,0) & \"</\" & A1982 & \">\"","v":"<Inverted_Flag>0</Inverted_Flag>"}]
["Camber",0,null,{"$f":"\"<\" & A1983 & \">\" & TEXT(B1983,\"0.000000\") & \"</\" & A1983 & \">\"","v":"<Camber>0.000000</Camber>"}]
["Camber_Loc",0.5,null,"<Camber_Loc>0.500000</Camber_Loc>"]
["Thickness",0.2,null,"<Thickness>0.200000</Thickness>"]
["Thickness_Loc",0.3,null,"<Thickness_Loc>0.300000</Thickness_Loc>"]
["Radius_Le",4.4075999999999997E-2,null,"<Radius_Le>0.044076</Radius_Le>"]
["Radius_Te",0,null,"<Radius_Te>0.000000</Radius_Te>"]
["Six_Series",63,null,{"$f":"\"<\" & A1989 & \">\" & TEXT(B1989,0) & \"</\" & A1989 & \">\"","v":"<Six_Series>63</Six_Series>"}]
["Ideal_Cl",0,null,{"$f":"\"<\" & A1990 & \">\" & TEXT(B1990,\"0.000000\") & \"</\" & A1990 & \">\"","v":"<Ideal_Cl>0.000000</Ideal_Cl>"}]
["A",0,null,{"$f":"\"<\" & A1991 & \">\" & TEXT(B1991,\"0.000000\") & \"</\" & A1991 & \">\"","v":"<A>0.000000</A>"}]
["Slat_Flag",0,null,{"$f":"\"<\" & A1992 & \">\" & TEXT(B1992,0) & \"</\" & A1992 & \">\"","v":"<Slat_Flag>0</Slat_Flag>"}]
["Slat_Shear_Flag",0,null,{"$f":"\"<\" & A1993 & \">\" & TEXT(B1993,0) & \"</\" & A1993 & \">\"","v":"<Slat_Shear_Flag>0</Slat_Shear_Flag>"}]
["Slat_Chord",0.25,null,{"$f":"\"<\" & A1994 & \">\" & TEXT(B1994,\"0.000000\") & \"</\" & A1994 & \">\"","v":"<Slat_Chord>0.250000</Slat_Chord>"}]
["Slat_Angle",10,null,{"$f":"\"<\" & A1995 & \">\" & TEXT(B1995,\"0.000000\") & \"</\" & A1995 & \">\"","v":"<Slat_Angle>10.000000</Slat_Angle>"}]
["Flap_Flag",0,null,{"$f":"\"<\" & A1996 & \">\" & TEXT(B1996,0) & \"</\" & A1996 & \">\"","v":"<Flap_Flag>0</Flap_Flag>"}]
["Flap_Shear_Flag",0,null,{"$f":"\"<\" & A1997 & \">\" & TEXT(B1997,0) & \"</\" & A1997 & \">\"","v":"<Flap_Shear_Flag>0</Flap_Shear_Flag>"}]
["Flap_Chord",0.25,null,{"$f":"\"<\" & A1998 & \">\" & TEXT(B1998,\"0.000000\") & \"</\" & A1998 & \">\"","v":"<Flap_Chord>0.250000</Flap_Chord>"}]
["Flap_Angle",10,null,{"$f":"\"<\" & A1999 & \">\" & TEXT(B1999,\"0.000000\") & \"</\" & A1999 & \">\"","v":"<Flap_Angle>10.000000</Flap_Angle>"}]
["/Airfoil",null,null,{"$f":"\"<\" & A2000 & \">\"","v":"</Airfoil>"}]
["/Sect_Parms",null,null,{"$f":"\"<\" & A2001 & \">\"","v":"</Sect_Parms>"}]
["Sect_Parms","Section2",null,{"$f":"\"<\" & A2002 & \">\"","v":"<Sect_Parms>"}]
["X_Off",{"$f":"B1470","v":0.9},null,{"$f":"\"<\" & A2003 & \">\" & TEXT(B2003,\"0.000000\") & \"</\" & A2003 & \">\"","v":"<X_Off>0.900000</X_Off>"}]
["Y_Off",{"$f":"B1471","v":0},null,{"$f":"\"<\" & A2004 & \">\" & TEXT(B2004,\"0.000000\") & \"</\" & A2004 & \">\"","v":"<Y_Off>0.000000</Y_Off>"}]
["Chord",{"$f":"B1472","v":7.0000000000000007E-2},null,{"$f":"\"<\" & A2005 & \">\" & TEXT(B2005,\"0.000000\") & \"</\" & A2005 & \">\"","v":"<Chord>0.070000</Chord>"}]
["Twist",{"$f":"B1473","v":5},null,{"$f":"\"<\" & A2006 & \">\" & TEXT(B2006,\"0.000000\") & \"</\" & A2006 & \">\"","v":"<Twist>5.000000</Twist>"}]
["Airfoil",null,null,{"$f":"\"<\" & A2007 & \">\"","v":"<Airfoil>"}]
["Type",{"$f":"B1475","v":1},null,{"$f":"\"<\" & A2008 & \">\" & TEXT(B2008,0) & \"</\" & A2008 & \">\"","v":"<Type>1</Type>"}]
["Inverted_Flag",0,null,{"$f":"\"<\" & A2009 & \">\" & TEXT(B2009,0) & \"</\" & A2009 & \">\"","v":"<Inverted_Flag>0</Inverted_Flag>"}]
["Camber",0,null,{"$f":"\"<\" & A2010 & \">\" & TEXT(B2010,\"0.000000\") & \"</\" & A2010 & \">\"","v":"<Camber>0.000000</Camber>"}]
["Camber_Loc",0.5,null,"<Camber_Loc>0.500000</Camber_Loc>"]
["Thickness",0.2,null,"<Thickness>0.200000</Thickness>"]
["Thickness_Loc",0.3,null,"<Thickness_Loc>0.300000</Thickness_Loc>"]
["Radius_Le",4.4075999999999997E-2,null,"<Radius_Le>0.044076</Radius_Le>"]
["Radius_Te",0,null,"<Radius_Te>0.000000</Radius_Te>"]
["Six_Series",63,null,{"$f":"\"<\" & A2016 & \">\" & TEXT(B2016,0) & \"</\" & A2016 & \">\"","v":"<Six_Series>63</Six_Series>"}]
["Ideal_Cl",0,null,{"$f":"\"<\" & A2017 & \">\" & TEXT(B2017,\"0.000000\") & \"</\" & A2017 & \">\"","v":"<Ideal_Cl>0.000000</Ideal_Cl>"}]
["A",0,null,{"$f":"\"<\" & A2018 & \">\" & TEXT(B2018,\"0.000000\") & \"</\" & A2018 & \">\"","v":"<A>0.000000</A>"}]
["Slat_Flag",0,null,{"$f":"\"<\" & A2019 & \">\" & TEXT(B2019,0) & \"</\" & A2019 & \">\"","v":"<Slat_Flag>0</Slat_Flag>"}]
["Slat_Shear_Flag",0,null,{"$f":"\"<\" & A2020 & \">\" & TEXT(B2020,0) & \"</\" & A2020 & \">\"","v":"<Slat_Shear_Flag>0</Slat_Shear_Flag>"}]
["Slat_Chord",0.25,null,{"$f":"\"<\" & A2021 & \">\" & TEXT(B2021,\"0.000000\") & \"</\" & A2021 & \">\"","v":"<Slat_Chord>0.250000</Slat_Chord>"}]
["Slat_Angle",10,null,{"$f":"\"<\" & A2022 & \">\" & TEXT(B2022,\"0.000000\") & \"</\" & A2022 & \">\"","v":"<Slat_Angle>10.000000</Slat_Angle>"}]
["Flap_Flag",0,null,{"$f":"\"<\" & A2023 & \">\" & TEXT(B2023,0) & \"</\" & A2023 & \">\"","v":"<Flap_Flag>0</Flap_Flag>"}]
["Flap_Shear_Flag",0,null,{"$f":"\"<\" & A2024 & \">\" & TEXT(B2024,0) & \"</\" & A2024 & \">\"","v":"<Flap_Shear_Flag>0</Flap_Shear_Flag>"}]
["Flap_Chord",0.25,null,{"$f":"\"<\" & A2025 & \">\" & TEXT(B2025,\"0.000000\") & \"</\" & A2025 & \">\"","v":"<Flap_Chord>0.250000</Flap_Chord>"}]
["Flap_Angle",10,null,{"$f":"\"<\" & A2026 & \">\" & TEXT(B2026,\"0.000000\") & \"</\" & A2026 & \">\"","v":"<Flap_Angle>10.000000</Flap_Angle>"}]
["/Airfoil",null,null,{"$f":"\"<\" & A2027 & \">\"","v":"</Airfoil>"}]
["/Sect_Parms",null,null,{"$f":"\"<\" & A2028 & \">\"","v":"</Sect_Parms>"}]
["Sect_Parms","Section3",null,{"$f":"\"<\" & A2029 & \">\"","v":"<Sect_Parms>"}]
["X_Off",{"$f":"B1497","v":1},null,{"$f":"\"<\" & A2030 & \">\" & TEXT(B2030,\"0.000000\") & \"</\" & A2030 & \">\"","v":"<X_Off>1.000000</X_Off>"}]
["Y_Off",{"$f":"B1498","v":0},null,{"$f":"\"<\" & A2031 & \">\" & TEXT(B2031,\"0.000000\") & \"</\" & A2031 & \">\"","v":"<Y_Off>0.000000</Y_Off>"}]
["Chord",{"$f":"B1499","v":0.02},null,{"$f":"\"<\" & A2032 & \">\" & TEXT(B2032,\"0.000000\") & \"</\" & A2032 & \">\"","v":"<Chord>0.020000</Chord>"}]
["Twist",{"$f":"B1500","v":2},null,{"$f":"\"<\" & A2033 & \">\" & TEXT(B2033,\"0.000000\") & \"</\" & A2033 & \">\"","v":"<Twist>2.000000</Twist>"}]
["Airfoil",null,null,{"$f":"\"<\" & A2034 & \">\"","v":"<Airfoil>"}]
["Type",{"$f":"B1502","v":1},null,{"$f":"\"<\" & A2035 & \">\" & TEXT(B2035,0) & \"</\" & A2035 & \">\"","v":"<Type>1</Type>"}]
["Inverted_Flag",0,null,{"$f":"\"<\" & A2036 & \">\" & TEXT(B2036,0) & \"</\" & A2036 & \">\"","v":"<Inverted_Flag>0</Inverted_Flag>"}]
["Camber",0,null,{"$f":"\"<\" & A2037 & \">\" & TEXT(B2037,\"0.000000\") & \"</\" & A2037 & \">\"","v":"<Camber>0.000000</Camber>"}]
["Camber_Loc",0.5,null,"<Camber_Loc>0.500000</Camber_Loc>"]
["Thickness",0.2,null,"<Thickness>0.200000</Thickness>"]
["Thickness_Loc",0.3,null,"<Thickness_Loc>0.300000</Thickness_Loc>"]
["Radius_Le",4.4075999999999997E-2,null,"<Radius_Le>0.044076</Radius_Le>"]
["Radius_Te",0,null,"<Radius_Te>0.000000</Radius_Te>"]
["Six_Series",63,null,{"$f":"\"<\" & A2043 & \">\" & TEXT(B2043,0) & \"</\" & A2043 & \">\"","v":"<Six_Series>63</Six_Series>"}]
["Ideal_Cl",0,null,{"$f":"\"<\" & A2044 & \">\" & TEXT(B2044,\"0.000000\") & \"</\" & A2044 & \">\"","v":"<Ideal_Cl>0.000000</Ideal_Cl>"}]
["A",0,null,{"$f":"\"<\" & A2045 & \">\" & TEXT(B2045,\"0.000000\") & \"</\" & A2045 & \">\"","v":"<A>0.000000</A>"}]
["Slat_Flag",0,null,{"$f":"\"<\" & A2046 & \">\" & TEXT(B2046,0) & \"</\" & A2046 & \">\"","v":"<Slat_Flag>0</Slat_Flag>"}]
["Slat_Shear_Flag",0,null,{"$f":"\"<\" & A2047 & \">\" & TEXT(B2047,0) & \"</\" & A2047 & \">\"","v":"<Slat_Shear_Flag>0</Slat_Shear_Flag>"}]
["Slat_Chord",0.25,null,{"$f":"\"<\" & A2048 & \">\" & TEXT(B2048,\"0.000000\") & \"</\" & A2048 & \">\"","v":"<Slat_Chord>0.250000</Slat_Chord>"}]
["Slat_Angle",10,null,{"$f":"\"<\" & A2049 & \">\" & TEXT(B2049,\"0.000000\") & \"</\" & A2049 & \">\"","v":"<Slat_Angle>10.000000</Slat_Angle>"}]
["Flap_Flag",0,null,{"$f":"\"<\" & A2050 & \">\" & TEXT(B2050,0) & \"</\" & A2050 & \">\"","v":"<Flap_Flag>0</Flap_Flag>"}]
["Flap_Shear_Flag",0,null,{"$f":"\"<\" & A2051 & \">\" & TEXT(B2051,0) & \"</\" & A2051 & \">\"","v":"<Flap_Shear_Flag>0</Flap_Shear_Flag>"}]
["Flap_Chord",0.25,null,{"$f":"\"<\" & A2052 & \">\" & TEXT(B2052,\"0.000000\") & \"</\" & A2052 & \">\"","v":"<Flap_Chord>0.250000</Flap_Chord>"}]
["Flap_Angle",10,null,{"$f":"\"<\" & A2053 & \">\" & TEXT(B2053,\"0.000000\") & \"</\" & A2053 & \">\"","v":"<Flap_Angle>10.000000</Flap_Angle>"}]
["/Airfoil",null,null,{"$f":"\"<\" & A2054 & \">\"","v":"</Airfoil>"}]
["/Sect_Parms",null,null,{"$f":"\"<\" & A2055 & \">\"","v":"</Sect_Parms>"}]
["/Prop_Parms",null,null,{"$f":"\"<\" & A2056 & \">\"","v":"</Prop_Parms>"}]
["/Component",null,{"$f":"C1890","v":"No"},{"$f":"IF(C2057=\"Yes\",(\"<\"&A2057&\">\"),(\"<\"&A2057&\"-->\"))","v":"</Component-->"}]
["Component","Pylon",{"$f":"IF(n_e>1,IF(Type_e=\"Jet\",\"Yes\",\"No\"),IF(n_e<2,\"Yes\",\"No\"))","v":"Yes"},{"$f":"IF(C2058=\"Yes\",(\"<\"&A2058&\">\"),(\"<!--\"&A2058&\">\"))","v":"<Component>"}]
["Type","Mswing",null,{"$f":"\"<\" & A2059 & \">\" & TEXT(B2059,\"0.000000\") & \"</\" & A2059 & \">\"","v":"<Type>Mswing</Type>"}]
["General_Parms",null,null,{"$f":"\"<\" & A2060 & \">\"","v":"<General_Parms>"}]
["Name",{"$f":"B1528","v":"pylon"},null,{"$f":"\"<\" & A2061 & \">\" & TEXT(B2061,\"0.000000\") & \"</\" & A2061 & \">\"","v":"<Name>pylon</Name>"}]
["ColorR",0,null,{"$f":"\"<\" & A2062 & \">\" & TEXT(B2062,\"0.000000\") & \"</\" & A2062 & \">\"","v":"<ColorR>0.000000</ColorR>"}]
["ColorG",255,null,{"$f":"\"<\" & A2063 & \">\" & TEXT(B2063,\"0.000000\") & \"</\" & A2063 & \">\"","v":"<ColorG>255.000000</ColorG>"}]
["ColorB",0,null,{"$f":"\"<\" & A2064 & \">\" & TEXT(B2064,\"0.000000\") & \"</\" & A2064 & \">\"","v":"<ColorB>0.000000</ColorB>"}]
["Symmetry",0,null,{"$f":"\"<\" & A2065 & \">\" & TEXT(B2065,0) & \"</\" & A2065 & \">\"","v":"<Symmetry>0</Symmetry>"}]
["RelXFormFlag",0,null,"<RelXFormFlag>0</RelXFormFlag>"]
["MaterialID",2,null,"<MaterialID>2</MaterialID>"]
["OutputFlag",1,null,"<OutputFlag>1</OutputFlag>"]
["OutputNameID",0,null,"<OutputNameID>0</OutputNameID>"]
["DisplayChildrenFlag",1,null,"<DisplayChildrenFlag>1</DisplayChildrenFlag>"]
["NumPnts",21,null,"<NumPnts>21</NumPnts>"]
["NumXsecs",11,null,"<NumXsecs>11</NumXsecs>"]
["MassPrior",0,null,"<MassPrior>0</MassPrior>"]
["ShellFlag",0,null,"<ShellFlag>0</ShellFlag>"]
["Tran_X",0,null,{"$f":"\"<\" & A2075 & \">\" & TEXT(B2075,\"0.000000\") & \"</\" & A2075 & \">\"","v":"<Tran_X>0.000000</Tran_X>"}]
["Tran_Y",0,null,"<Tran_Y>0.000000</Tran_Y>"]
["Tran_Z",1.69,null,"<Tran_Z>1.690000</Tran_Z>"]
["TranRel_X",0,null,"<TranRel_X>0.000000</TranRel_X>"]
["TranRel_Y",0,null,"<TranRel_Y>0.000000</TranRel_Y>"]
["TranRel_Z",0,null,"<TranRel_Z>0.000000</TranRel_Z>"]
["Rot_X",90,null,"<Rot_X>90.000000</Rot_X>"]
["Rot_Y",0,null,"<Rot_Y>0.000000</Rot_Y>"]
["Rot_Z",0,null,"<Rot_Z>0.000000</Rot_Z>"]
["RotRel_X",0,null,"<RotRel_X>0.000000</RotRel_X>"]
["RotRel_Y",0,null,"<RotRel_Y>0.000000</RotRel_Y>"]
["RotRel_Z",0,null,"<RotRel_Z>0.000000</RotRel_Z>"]
["Origin",0,null,"<Origin>0.000000</Origin>"]
["Density",1,null,"<Density>1.000000</Density>"]
["ShellMassArea",1,null,"<ShellMassArea>1.000000</ShellMassArea>"]
["RefFlag",0,null,{"$f":"\"<\" & A2090 & \">\" & TEXT(B2090,0) & \"</\" & A2090 & \">\"","v":"<RefFlag>0</RefFlag>"}]
["RefArea",100,null,{"$f":"\"<\" & A2091 & \">\" & TEXT(B2091,\"0.000000\") & \"</\" & A2091 & \">\"","v":"<RefArea>100.000000</RefArea>"}]
["RefSpan",10,null,{"$f":"\"<\" & A2092 & \">\" & TEXT(B2092,\"0.000000\") & \"</\" & A2092 & \">\"","v":"<RefSpan>10.000000</RefSpan>"}]
["RefCbar",1,null,{"$f":"\"<\" & A2093 & \">\" & TEXT(B2093,\"0.000000\") & \"</\" & A2093 & \">\"","v":"<RefCbar>1.000000</RefCbar>"}]
["AutoRefAreaFlag",1,null,{"$f":"\"<\" & A2094 & \">\" & TEXT(B2094,0) & \"</\" & A2094 & \">\"","v":"<AutoRefAreaFlag>1</AutoRefAreaFlag>"}]
["AutoRefSpanFlag",1,null,{"$f":"\"<\" & A2095 & \">\" & TEXT(B2095,0) & \"</\" & A2095 & \">\"","v":"<AutoRefSpanFlag>1</AutoRefSpanFlag>"}]
["AutoRefCbarFlag",1,null,{"$f":"\"<\" & A2096 & \">\" & TEXT(B2096,0) & \"</\" & A2096 & \">\"","v":"<AutoRefCbarFlag>1</AutoRefCbarFlag>"}]
["AeroCenter_X",0,null,{"$f":"\"<\" & A2097 & \">\" & TEXT(B2097,\"0.000000\") & \"</\" & A2097 & \">\"","v":"<AeroCenter_X>0.000000</AeroCenter_X>"}]
["AeroCenter_Y",0,null,{"$f":"\"<\" & A2098 & \">\" & TEXT(B2098,\"0.000000\") & \"</\" & A2098 & \">\"","v":"<AeroCenter_Y>0.000000</AeroCenter_Y>"}]
["AeroCenter_Z",0,null,{"$f":"\"<\" & A2099 & \">\" & TEXT(B2099,\"0.000000\") & \"</\" & A2099 & \">\"","v":"<AeroCenter_Z>0.000000</AeroCenter_Z>"}]
["AutoAeroCenterFlag",1,null,{"$f":"\"<\" & A2100 & \">\" & TEXT(B2100,0) & \"</\" & A2100 & \">\"","v":"<AutoAeroCenterFlag>1</AutoAeroCenterFlag>"}]
["WakeActiveFlag",0,null,{"$f":"\"<\" & A2101 & \">\" & TEXT(B2101,0) & \"</\" & A2101 & \">\"","v":"<WakeActiveFlag>0</WakeActiveFlag>"}]
["PosAttachFlag",3,null,{"$f":"\"<\" & A2102 & \">\" & TEXT(B2102,0) & \"</\" & A2102 & \">\"","v":"<PosAttachFlag>3</PosAttachFlag>"}]
["U_Attach",0,null,{"$f":"\"<\" & A2103 & \">\" & TEXT(B2103,\"0.000000\") & \"</\" & A2103 & \">\"","v":"<U_Attach>0.000000</U_Attach>"}]
["V_Attach",0,null,{"$f":"\"<\" & A2104 & \">\" & TEXT(B2104,\"0.000000\") & \"</\" & A2104 & \">\"","v":"<V_Attach>0.000000</V_Attach>"}]
["PtrID",148458297,null,{"$f":"\"<\" & A2105 & \">\" & TEXT(B2105,0) & \"</\" & A2105 & \">\"","v":"<PtrID>148458297</PtrID>"}]
["Parent_PtrID",148674848,null,{"$f":"\"<\" & A2106 & \">\" & TEXT(B2106,0) & \"</\" & A2106 & \">\"","v":"<Parent_PtrID>148674848</Parent_PtrID>"}]
["/General_Parms",null,null,{"$f":"\"<\" & A2107 & \">\"","v":"</General_Parms>"}]
["Mswing_Parms",null,null,{"$f":"\"<\" & A2108 & \">\"","v":"<Mswing_Parms>"}]
["Total_Area",{"$f":"B2169","v":3.2856815572538682},null,{"$f":"\"<\" & A2109 & \">\" & TEXT(B2109,\"0.000000\") & \"</\" & A2109 & \">\"","v":"<Total_Area>3.285682</Total_Area>"}]
["Total_Span",{"$f":"B2170","v":0.9},null,{"$f":"\"<\" & A2110 & \">\" & TEXT(B2110,\"0.000000\") & \"</\" & A2110 & \">\"","v":"<Total_Span>0.900000</Total_Span>"}]
["Total_Proj_Span",{"$f":"B2170*COS(B2177*PI()/180)","v":0.9},null,{"$f":"\"<\" & A2111 & \">\" & TEXT(B2111,\"0.000000\") & \"</\" & A2111 & \">\"","v":"<Total_Proj_Span>0.900000</Total_Proj_Span>"}]
["Avg_Chord",{"$f":"B2109/B2110","v":3.6507572858376314},null,{"$f":"\"<\" & A2112 & \">\" & TEXT(B2112,\"0.000000\") & \"</\" & A2112 & \">\"","v":"<Avg_Chord>3.650757</Avg_Chord>"}]
["Sweep_Off",{"$f":"B1580","v":0},null,{"$f":"\"<\" & A2113 & \">\" & TEXT(B2113,\"0.000000\") & \"</\" & A2113 & \">\"","v":"<Sweep_Off>0.000000</Sweep_Off>"}]
["Deg_Per_Seg",9,null,{"$f":"\"<\" & A2114 & \">\" & TEXT(B2114,0) & \"</\" & A2114 & \">\"","v":"<Deg_Per_Seg>9</Deg_Per_Seg>"}]
["Max_Num_Seg",9,null,{"$f":"\"<\" & A2115 & \">\" & TEXT(B2115,0) & \"</\" & A2115 & \">\"","v":"<Max_Num_Seg>9</Max_Num_Seg>"}]
["Rel_Dihedral_Flag",0,null,{"$f":"\"<\" & A2116 & \">\" & TEXT(B2116,0) & \"</\" & A2116 & \">\"","v":"<Rel_Dihedral_Flag>0</Rel_Dihedral_Flag>"}]
["Rel_Twist_Flag",0,null,{"$f":"\"<\" & A2117 & \">\" & TEXT(B2117,0) & \"</\" & A2117 & \">\"","v":"<Rel_Twist_Flag>0</Rel_Twist_Flag>"}]
["Round_End_Cap_Flag",0,null,{"$f":"\"<\" & A2118 & \">\" & TEXT(B2118,0) & \"</\" & A2118 & \">\"","v":"<Round_End_Cap_Flag>0</Round_End_Cap_Flag>"}]
["/Mswing_Parms",null,null,{"$f":"\"<\" & A2119 & \">\"","v":"</Mswing_Parms>"}]
["Airfoil_List",null,null,{"$f":"\"<\" & A2120 & \">\"","v":"<Airfoil_List>"}]
["Airfoil","Airfoil0",null,{"$f":"\"<\" & A2121 & \">\"","v":"<Airfoil>"}]
["Type",{"$f":"B1589","v":1},null,{"$f":"\"<\" & A2122 & \">\" & TEXT(B2122,0) & \"</\" & A2122 & \">\"","v":"<Type>1</Type>"}]
["Inverted_Flag",0,null,{"$f":"\"<\" & A2123 & \">\" & TEXT(B2123,0) & \"</\" & A2123 & \">\"","v":"<Inverted_Flag>0</Inverted_Flag>"}]
["Camber",0,null,{"$f":"\"<\" & A2124 & \">\" & TEXT(B2124,\"0.000000\") & \"</\" & A2124 & \">\"","v":"<Camber>0.000000</Camber>"}]
["Camber_Loc",0.5,null,"<Camber_Loc>0.500000</Camber_Loc>"]
["Thickness",0.08,null,"<Thickness>0.080000</Thickness>"]
["Thickness_Loc",0.3,null,"<Thickness_Loc>0.300000</Thickness_Loc>"]
["Radius_Le",7.0520000000000001E-3,null,"<Radius_Le>0.007052</Radius_Le>"]
["Radius_Te",0,null,"<Radius_Te>0.000000</Radius_Te>"]
["Six_Series",63,null,{"$f":"\"<\" & A2130 & \">\" & TEXT(B2130,0) & \"</\" & A2130 & \">\"","v":"<Six_Series>63</Six_Series>"}]
["Ideal_Cl",0,null,{"$f":"\"<\" & A2131 & \">\" & TEXT(B2131,\"0.000000\") & \"</\" & A2131 & \">\"","v":"<Ideal_Cl>0.000000</Ideal_Cl>"}]
["A",0,null,{"$f":"\"<\" & A2132 & \">\" & TEXT(B2132,\"0.000000\") & \"</\" & A2132 & \">\"","v":"<A>0.000000</A>"}]
["Slat_Flag",0,null,{"$f":"\"<\" & A2133 & \">\" & TEXT(B2133,0) & \"</\" & A2133 & \">\"","v":"<Slat_Flag>0</Slat_Flag>"}]
["Slat_Shear_Flag",0,null,{"$f":"\"<\" & A2134 & \">\" & TEXT(B2134,0) & \"</\" & A2134 & \">\"","v":"<Slat_Shear_Flag>0</Slat_Shear_Flag>"}]
["Slat_Chord",0.25,null,{"$f":"\"<\" & A2135 & \">\" & TEXT(B2135,\"0.000000\") & \"</\" & A2135 & \">\"","v":"<Slat_Chord>0.250000</Slat_Chord>"}]
["Slat_Angle",10,null,{"$f":"\"<\" & A2136 & \">\" & TEXT(B2136,\"0.000000\") & \"</\" & A2136 & \">\"","v":"<Slat_Angle>10.000000</Slat_Angle>"}]
["Flap_Flag",0,null,{"$f":"\"<\" & A2137 & \">\" & TEXT(B2137,0) & \"</\" & A2137 & \">\"","v":"<Flap_Flag>0</Flap_Flag>"}]
["Flap_Shear_Flag",0,null,{"$f":"\"<\" & A2138 & \">\" & TEXT(B2138,0) & \"</\" & A2138 & \">\"","v":"<Flap_Shear_Flag>0</Flap_Shear_Flag>"}]
["Flap_Chord",0.25,null,{"$f":"\"<\" & A2139 & \">\" & TEXT(B2139,\"0.000000\") & \"</\" & A2139 & \">\"","v":"<Flap_Chord>0.250000</Flap_Chord>"}]
["Flap_Angle",10,null,{"$f":"\"<\" & A2140 & \">\" & TEXT(B2140,\"0.000000\") & \"</\" & A2140 & \">\"","v":"<Flap_Angle>10.000000</Flap_Angle>"}]
["/Airfoil",null,null,{"$f":"\"<\" & A2141 & \">\"","v":"</Airfoil>"}]
["Airfoil","Airfoil1",null,{"$f":"\"<\" & A2142 & \">\"","v":"<Airfoil>"}]
["Type",{"$f":"B1610","v":1},null,{"$f":"\"<\" & A2143 & \">\" & TEXT(B2143,0) & \"</\" & A2143 & \">\"","v":"<Type>1</Type>"}]
["Inverted_Flag",0,null,{"$f":"\"<\" & A2144 & \">\" & TEXT(B2144,0) & \"</\" & A2144 & \">\"","v":"<Inverted_Flag>0</Inverted_Flag>"}]
["Camber",0,null,{"$f":"\"<\" & A2145 & \">\" & TEXT(B2145,\"0.000000\") & \"</\" & A2145 & \">\"","v":"<Camber>0.000000</Camber>"}]
["Camber_Loc",0.5,null,"<Camber_Loc>0.500000</Camber_Loc>"]
["Thickness",0.08,null,"<Thickness>0.080000</Thickness>"]
["Thickness_Loc",0.3,null,"<Thickness_Loc>0.300000</Thickness_Loc>"]
["Radius_Le",7.0520000000000001E-3,null,"<Radius_Le>0.007052</Radius_Le>"]
["Radius_Te",0,null,"<Radius_Te>0.000000</Radius_Te>"]
["Six_Series",63,null,{"$f":"\"<\" & A2151 & \">\" & TEXT(B2151,0) & \"</\" & A2151 & \">\"","v":"<Six_Series>63</Six_Series>"}]
["Ideal_Cl",0,null,{"$f":"\"<\" & A2152 & \">\" & TEXT(B2152,\"0.000000\") & \"</\" & A2152 & \">\"","v":"<Ideal_Cl>0.000000</Ideal_Cl>"}]
["A",0,null,{"$f":"\"<\" & A2153 & \">\" & TEXT(B2153,\"0.000000\") & \"</\" & A2153 & \">\"","v":"<A>0.000000</A>"}]
["Slat_Flag",0,null,{"$f":"\"<\" & A2154 & \">\" & TEXT(B2154,0) & \"</\" & A2154 & \">\"","v":"<Slat_Flag>0</Slat_Flag>"}]
["Slat_Shear_Flag",0,null,{"$f":"\"<\" & A2155 & \">\" & TEXT(B2155,0) & \"</\" & A2155 & \">\"","v":"<Slat_Shear_Flag>0</Slat_Shear_Flag>"}]
["Slat_Chord",0.25,null,{"$f":"\"<\" & A2156 & \">\" & TEXT(B2156,\"0.000000\") & \"</\" & A2156 & \">\"","v":"<Slat_Chord>0.250000</Slat_Chord>"}]
["Slat_Angle",10,null,{"$f":"\"<\" & A2157 & \">\" & TEXT(B2157,\"0.000000\") & \"</\" & A2157 & \">\"","v":"<Slat_Angle>10.000000</Slat_Angle>"}]
["Flap_Flag",0,null,{"$f":"\"<\" & A2158 & \">\" & TEXT(B2158,0) & \"</\" & A2158 & \">\"","v":"<Flap_Flag>0</Flap_Flag>"}]
["Flap_Shear_Flag",0,null,{"$f":"\"<\" & A2159 & \">\" & TEXT(B2159,0) & \"</\" & A2159 & \">\"","v":"<Flap_Shear_Flag>0</Flap_Shear_Flag>"}]
["Flap_Chord",0.25,null,{"$f":"\"<\" & A2160 & \">\" & TEXT(B2160,\"0.000000\") & \"</\" & A2160 & \">\"","v":"<Flap_Chord>0.250000</Flap_Chord>"}]
["Flap_Angle",10,null,{"$f":"\"<\" & A2161 & \">\" & TEXT(B2161,\"0.000000\") & \"</\" & A2161 & \">\"","v":"<Flap_Angle>10.000000</Flap_Angle>"}]
["/Airfoil",null,null,{"$f":"\"<\" & A2162 & \">\"","v":"</Airfoil>"}]
["/Airfoil_List",null,null,{"$f":"\"<\" & A2163 & \">\"","v":"</Airfoil_List>"}]
["Section_List",null,null,{"$f":"\"<\" & A2164 & \">\"","v":"<Section_List>"}]
["Section","Section0",null,{"$f":"\"<\" & A2165 & \">\"","v":"<Section>"}]
["Driver",{"$f":"B1633","v":4},null,{"$f":"\"<\" & A2166 & \">\" & TEXT(B2166,0) & \"</\" & A2166 & \">\"","v":"<Driver>4</Driver>"}]
["AR",{"$f":"(B2170^2)/B2169","v":0.24652419471745399},null,{"$f":"\"<\" & A2167 & \">\" & TEXT(B2167,\"0.000000\") & \"</\" & A2167 & \">\"","v":"<AR>0.246524</AR>"}]
["TR",{"$f":"B2171/B2172","v":1},null,"<TR>1.000000</TR>"]
["Area",{"$f":"0.5*(B2171+B2172)*B2170","v":3.2856815572538682},null,"<Area>3.285682</Area>"]
["Span",0.9,null,"<Span>0.900000</Span>"]
["TC",{"$f":"0.8*IF(-B1761 < b_W.i, c_r.W - B1761*(TAN(phi_100.W.i*PI()/180) - TAN(phi_0.W.i*PI()/180)), c_W.k - B1761*(TAN(phi_100.W.o*PI()/180) - TAN(phi_0.W.o*PI()/180)))","v":3.6507572858376314},null,"<TC>3.650757</TC>"]
["RC",{"$f":"B2171","v":3.6507572858376314},null,"<RC>3.650757</RC>"]
["Sweep",50,null,"<Sweep>50.000000</Sweep>"]
["SweepLoc",0,null,"<SweepLoc>0.000000</SweepLoc>"]
["Twist",0,null,"<Twist>0.000000</Twist>"]
["TwistLoc",0,null,"<TwistLoc>0.000000</TwistLoc>"]
["Dihedral",0,null,"<Dihedral>0.000000</Dihedral>"]
["Dihed_Crv1",0,null,"<Dihed_Crv1>0.000000</Dihed_Crv1>"]
["Dihed_Crv2",0,null,"<Dihed_Crv2>0.000000</Dihed_Crv2>"]
["Dihed_Crv1_Str",0.75,null,"<Dihed_Crv1_Str>0.750000</Dihed_Crv1_Str>"]
["Dihed_Crv2_Str",0.75,null,"<Dihed_Crv2_Str>0.750000</Dihed_Crv2_Str>"]
["DihedRotFlag",0,null,{"$f":"\"<\" & A2182 & \">\" & TEXT(B2182,0) & \"</\" & A2182 & \">\"","v":"<DihedRotFlag>0</DihedRotFlag>"}]
["SmoothBlendFlag",0,null,{"$f":"\"<\" & A2183 & \">\" & TEXT(B2183,0) & \"</\" & A2183 & \">\"","v":"<SmoothBlendFlag>0</SmoothBlendFlag>"}]
["NumInterpXsecs",1,null,{"$f":"\"<\" & A2184 & \">\" & TEXT(B2184,0) & \"</\" & A2184 & \">\"","v":"<NumInterpXsecs>1</NumInterpXsecs>"}]
["/Section",null,null,{"$f":"\"<\" & A2185 & \">\"","v":"</Section>"}]
["/Section_List",null,null,{"$f":"\"<\" & A2186 & \">\"","v":"</Section_List>"}]
["/Component",null,{"$f":"C2058","v":"Yes"},{"$f":"IF(C2187=\"Yes\",(\"<\"&A2187&\">\"),(\"<\"&A2187&\"-->\"))","v":"</Component>"}]
["Component","FanSect",{"$f":"IF(AND(C1743=\"Yes\",C1890=\"Yes\"),\"No\",\"Yes\")","v":"Yes"},{"$f":"IF(C2188=\"Yes\",(\"<\"&A2188&\">\"),(\"<!--\"&A2188&\">\"))","v":"<Component>"}]
["Type","Engine",null,{"$f":"\"<\" & A2189 & \">\" & TEXT(B2189,\"0.000000\") & \"</\" & A2189 & \">\"","v":"<Type>Engine</Type>"}]
["General_Parms",null,null,{"$f":"\"<\" & A2190 & \">\"","v":"<General_Parms>"}]
["Name",{"$f":"B1658","v":"fan_section"},null,{"$f":"\"<\" & A2191 & \">\" & TEXT(B2191,\"0.000000\") & \"</\" & A2191 & \">\"","v":"<Name>fan_section</Name>"}]
["ColorR",0,null,{"$f":"\"<\" & A2192 & \">\" & TEXT(B2192,\"0.000000\") & \"</\" & A2192 & \">\"","v":"<ColorR>0.000000</ColorR>"}]
["ColorG",0,null,{"$f":"\"<\" & A2193 & \">\" & TEXT(B2193,\"0.000000\") & \"</\" & A2193 & \">\"","v":"<ColorG>0.000000</ColorG>"}]
["ColorB",255,null,{"$f":"\"<\" & A2194 & \">\" & TEXT(B2194,\"0.000000\") & \"</\" & A2194 & \">\"","v":"<ColorB>255.000000</ColorB>"}]
["Symmetry",0,null,{"$f":"\"<\" & A2195 & \">\" & TEXT(B2195,0) & \"</\" & A2195 & \">\"","v":"<Symmetry>0</Symmetry>"}]
["RelXFormFlag",0,null,"<RelXFormFlag>0</RelXFormFlag>"]
["MaterialID",2,null,"<MaterialID>2</MaterialID>"]
["OutputFlag",1,null,"<OutputFlag>1</OutputFlag>"]
["OutputNameID",0,null,"<OutputNameID>0</OutputNameID>"]
["DisplayChildrenFlag",1,null,"<DisplayChildrenFlag>1</DisplayChildrenFlag>"]
["NumPnts",21,null,"<NumPnts>21</NumPnts>"]
["NumXsecs",11,null,"<NumXsecs>11</NumXsecs>"]
["MassPrior",0,null,"<MassPrior>0</MassPrior>"]
["ShellFlag",0,null,"<ShellFlag>0</ShellFlag>"]
["Tran_X",0,null,{"$f":"\"<\" & A2205 & \">\" & TEXT(B2205,\"0.000000\") & \"</\" & A2205 & \">\"","v":"<Tran_X>0.000000</Tran_X>"}]
["Tran_Y",0,null,"<Tran_Y>0.000000</Tran_Y>"]
["Tran_Z",0,null,"<Tran_Z>0.000000</Tran_Z>"]
["TranRel_X",0,null,"<TranRel_X>0.000000</TranRel_X>"]
["TranRel_Y",0,null,"<TranRel_Y>0.000000</TranRel_Y>"]
["TranRel_Z",0,null,"<TranRel_Z>0.000000</TranRel_Z>"]
["Rot_X",0,null,"<Rot_X>0.000000</Rot_X>"]
["Rot_Y",0,null,"<Rot_Y>0.000000</Rot_Y>"]
["Rot_Z",0,null,"<Rot_Z>0.000000</Rot_Z>"]
["RotRel_X",0,null,"<RotRel_X>0.000000</RotRel_X>"]
["RotRel_Y",0,null,"<RotRel_Y>0.000000</RotRel_Y>"]
["RotRel_Z",0,null,"<RotRel_Z>0.000000</RotRel_Z>"]
["Origin",0,null,"<Origin>0.000000</Origin>"]
["Density",1,null,"<Density>1.000000</Density>"]
["ShellMassArea",1,null,"<ShellMassArea>1.000000</ShellMassArea>"]
["RefFlag",0,null,{"$f":"\"<\" & A2220 & \">\" & TEXT(B2220,0) & \"</\" & A2220 & \">\"","v":"<RefFlag>0</RefFlag>"}]
["RefArea",100,null,{"$f":"\"<\" & A2221 & \">\" & TEXT(B2221,\"0.000000\") & \"</\" & A2221 & \">\"","v":"<RefArea>100.000000</RefArea>"}]
["RefSpan",10,null,{"$f":"\"<\" & A2222 & \">\" & TEXT(B2222,\"0.000000\") & \"</\" & A2222 & \">\"","v":"<RefSpan>10.000000</RefSpan>"}]
["RefCbar",1,null,{"$f":"\"<\" & A2223 & \">\" & TEXT(B2223,\"0.000000\") & \"</\" & A2223 & \">\"","v":"<RefCbar>1.000000</RefCbar>"}]
["AutoRefAreaFlag",1,null,{"$f":"\"<\" & A2224 & \">\" & TEXT(B2224,0) & \"</\" & A2224 & \">\"","v":"<AutoRefAreaFlag>1</AutoRefAreaFlag>"}]
["AutoRefSpanFlag",1,null,{"$f":"\"<\" & A2225 & \">\" & TEXT(B2225,0) & \"</\" & A2225 & \">\"","v":"<AutoRefSpanFlag>1</AutoRefSpanFlag>"}]
["AutoRefCbarFlag",1,null,{"$f":"\"<\" & A2226 & \">\" & TEXT(B2226,0) & \"</\" & A2226 & \">\"","v":"<AutoRefCbarFlag>1</AutoRefCbarFlag>"}]
["AeroCenter_X",0,null,{"$f":"\"<\" & A2227 & \">\" & TEXT(B2227,\"0.000000\") & \"</\" & A2227 & \">\"","v":"<AeroCenter_X>0.000000</AeroCenter_X>"}]
["AeroCenter_Y",0,null,{"$f":"\"<\" & A2228 & \">\" & TEXT(B2228,\"0.000000\") & \"</\" & A2228 & \">\"","v":"<AeroCenter_Y>0.000000</AeroCenter_Y>"}]
["AeroCenter_Z",0,null,{"$f":"\"<\" & A2229 & \">\" & TEXT(B2229,\"0.000000\") & \"</\" & A2229 & \">\"","v":"<AeroCenter_Z>0.000000</AeroCenter_Z>"}]
["AutoAeroCenterFlag",1,null,{"$f":"\"<\" & A2230 & \">\" & TEXT(B2230,0) & \"</\" & A2230 & \">\"","v":"<AutoAeroCenterFlag>1</AutoAeroCenterFlag>"}]
["WakeActiveFlag",0,null,{"$f":"\"<\" & A2231 & \">\" & TEXT(B2231,0) & \"</\" & A2231 & \">\"","v":"<WakeActiveFlag>0</WakeActiveFlag>"}]
["PosAttachFlag",3,null,{"$f":"\"<\" & A2232 & \">\" & TEXT(B2232,0) & \"</\" & A2232 & \">\"","v":"<PosAttachFlag>3</PosAttachFlag>"}]
["U_Attach",0,null,{"$f":"\"<\" & A2233 & \">\" & TEXT(B2233,\"0.000000\") & \"</\" & A2233 & \">\"","v":"<U_Attach>0.000000</U_Attach>"}]
["V_Attach",0,null,{"$f":"\"<\" & A2234 & \">\" & TEXT(B2234,\"0.000000\") & \"</\" & A2234 & \">\"","v":"<V_Attach>0.000000</V_Attach>"}]
["PtrID",148906600,null,{"$f":"\"<\" & A2235 & \">\" & TEXT(B2235,0) & \"</\" & A2235 & \">\"","v":"<PtrID>148906600</PtrID>"}]
["Parent_PtrID",148674848,null,{"$f":"\"<\" & A2236 & \">\" & TEXT(B2236,0) & \"</\" & A2236 & \">\"","v":"<Parent_PtrID>148674848</Parent_PtrID>"}]
["/General_Parms",null,null,{"$f":"\"<\" & A2237 & \">\"","v":"</General_Parms>"}]
["Engine_Parms",null,null,{"$f":"\"<\" & A2238 & \">\"","v":"<Engine_Parms>"}]
["Engine_Type",{"$f":"B1706","v":0},null,{"$f":"\"<\" & A2239 & \">\" & TEXT(B2239,0) & \"</\" & A2239 & \">\"","v":"<Engine_Type>0</Engine_Type>"}]
["Radius_Tip",1.69,null,{"$f":"\"<\" & A2240 & \">\" & TEXT(B2240,\"0.000000\") & \"</\" & A2240 & \">\"","v":"<Radius_Tip>1.690000</Radius_Tip>"}]
["Max_Tip",1.1499999999999999,null,{"$f":"\"<\" & A2241 & \">\" & TEXT(B2241,\"0.000000\") & \"</\" & A2241 & \">\"","v":"<Max_Tip>1.150000</Max_Tip>"}]
["Hub_Tip",0.31333299999999997,null,{"$f":"\"<\" & A2242 & \">\" & TEXT(B2242,\"0.000000\") & \"</\" & A2242 & \">\"","v":"<Hub_Tip>0.313333</Hub_Tip>"}]
["Eng_Length",0,null,{"$f":"\"<\" & A2243 & \">\" & TEXT(B2243,\"0.000000\") & \"</\" & A2243 & \">\"","v":"<Eng_Length>0.000000</Eng_Length>"}]
["Inlet_Type",1,null,{"$f":"\"<\" & A2244 & \">\" & TEXT(B2244,0) & \"</\" & A2244 & \">\"","v":"<Inlet_Type>1</Inlet_Type>"}]
["Inl_Noz_Color",0,null,{"$f":"\"<\" & A2245 & \">\" & TEXT(B2245,0) & \"</\" & A2245 & \">\"","v":"<Inl_Noz_Color>0</Inl_Noz_Color>"}]
["Inlet_XY_Sym_Flag",0,null,{"$f":"\"<\" & A2246 & \">\" & TEXT(B2246,0) & \"</\" & A2246 & \">\"","v":"<Inlet_XY_Sym_Flag>0</Inlet_XY_Sym_Flag>"}]
["Inlet_Half_Split_Flag",0,null,{"$f":"\"<\" & A2247 & \">\" & TEXT(B2247,0) & \"</\" & A2247 & \">\"","v":"<Inlet_Half_Split_Flag>0</Inlet_Half_Split_Flag>"}]
["Cowl_Length",1.3726875000000003,null,{"$f":"\"<\" & A2248 & \">\" & TEXT(B2248,\"0.000000\") & \"</\" & A2248 & \">\"","v":"<Cowl_Length>1.372688</Cowl_Length>"}]
["Eng_Thrt_Ratio",1.1499999999999999,null,"<Eng_Thrt_Ratio>1.150000</Eng_Thrt_Ratio>"]
["Hilight_Thrt_Ratio",1.1499999999999999,null,"<Hilight_Thrt_Ratio>1.150000</Hilight_Thrt_Ratio>"]
["Lip_Finess_Ratio",1.026904,null,"<Lip_Finess_Ratio>1.026904</Lip_Finess_Ratio>"]
["Height_Width_Ratio",1,null,"<Height_Width_Ratio>1.000000</Height_Width_Ratio>"]
["Upper_Surf_Shape_Factor",-0.95229299999999995,null,"<Upper_Surf_Shape_Factor>-0.952293</Upper_Surf_Shape_Factor>"]
["Lower_Surf_Shape_Factor",0.66507400000000005,null,"<Lower_Surf_Shape_Factor>0.665074</Lower_Surf_Shape_Factor>"]
["Inlet_X_Axis_Rot",90,null,"<Inlet_X_Axis_Rot>90.000000</Inlet_X_Axis_Rot>"]
["Inlet_Scarf_Angle",2,null,"<Inlet_Scarf_Angle>2.000000</Inlet_Scarf_Angle>"]
["Inlet_Duct_On_Off",0,null,{"$f":"\"<\" & A2257 & \">\" & TEXT(B2257,0) & \"</\" & A2257 & \">\"","v":"<Inlet_Duct_On_Off>0</Inlet_Duct_On_Off>"}]
["Inlet_Duct_X_Offset",3,null,{"$f":"\"<\" & A2258 & \">\" & TEXT(B2258,\"0.000000\") & \"</\" & A2258 & \">\"","v":"<Inlet_Duct_X_Offset>3.000000</Inlet_Duct_X_Offset>"}]
["Inlet_Duct_Y_Offset",1,null,{"$f":"\"<\" & A2259 & \">\" & TEXT(B2259,\"0.000000\") & \"</\" & A2259 & \">\"","v":"<Inlet_Duct_Y_Offset>1.000000</Inlet_Duct_Y_Offset>"}]
["Inlet_Duct_Shape_Factor",0.5,null,{"$f":"\"<\" & A2260 & \">\" & TEXT(B2260,\"0.000000\") & \"</\" & A2260 & \">\"","v":"<Inlet_Duct_Shape_Factor>0.500000</Inlet_Duct_Shape_Factor>"}]
["Divertor_On_Off",0,null,{"$f":"\"<\" & A2261 & \">\" & TEXT(B2261,0) & \"</\" & A2261 & \">\"","v":"<Divertor_On_Off>0</Divertor_On_Off>"}]
["Divertor_Height",0.5,null,{"$f":"\"<\" & A2262 & \">\" & TEXT(B2262,\"0.000000\") & \"</\" & A2262 & \">\"","v":"<Divertor_Height>0.500000</Divertor_Height>"}]
["Divertor_Length",1,null,{"$f":"\"<\" & A2263 & \">\" & TEXT(B2263,\"0.000000\") & \"</\" & A2263 & \">\"","v":"<Divertor_Length>1.000000</Divertor_Length>"}]
["Nozzle_Type",0,null,{"$f":"\"<\" & A2264 & \">\" & TEXT(B2264,0) & \"</\" & A2264 & \">\"","v":"<Nozzle_Type>0</Nozzle_Type>"}]
["Nozzle_Length",1.3726875000000003,null,{"$f":"\"<\" & A2265 & \">\" & TEXT(B2265,\"0.000000\") & \"</\" & A2265 & \">\"","v":"<Nozzle_Length>1.372688</Nozzle_Length>"}]
["Exit_Area_Ratio",1.2,null,{"$f":"\"<\" & A2266 & \">\" & TEXT(B2266,\"0.000000\") & \"</\" & A2266 & \">\"","v":"<Exit_Area_Ratio>1.200000</Exit_Area_Ratio>"}]
["Nozzle_Height_Width_Ratio",1,null,{"$f":"\"<\" & A2267 & \">\" & TEXT(B2267,\"0.000000\") & \"</\" & A2267 & \">\"","v":"<Nozzle_Height_Width_Ratio>1.000000</Nozzle_Height_Width_Ratio>"}]
["Exit_Throat_Ratio",1.5,null,{"$f":"\"<\" & A2268 & \">\" & TEXT(B2268,\"0.000000\") & \"</\" & A2268 & \">\"","v":"<Exit_Throat_Ratio>1.500000</Exit_Throat_Ratio>"}]
["Dive_Flap_Ratio",1,null,{"$f":"\"<\" & A2269 & \">\" & TEXT(B2269,\"0.000000\") & \"</\" & A2269 & \">\"","v":"<Dive_Flap_Ratio>1.000000</Dive_Flap_Ratio>"}]
["Nozzle_Duct_On_Off",0,null,{"$f":"\"<\" & A2270 & \">\" & TEXT(B2270,0) & \"</\" & A2270 & \">\"","v":"<Nozzle_Duct_On_Off>0</Nozzle_Duct_On_Off>"}]
["Nozzle_Duct_X_Offset",1,null,{"$f":"\"<\" & A2271 & \">\" & TEXT(B2271,\"0.000000\") & \"</\" & A2271 & \">\"","v":"<Nozzle_Duct_X_Offset>1.000000</Nozzle_Duct_X_Offset>"}]
["Nozzle_Duct_Y_Offset",0,null,{"$f":"\"<\" & A2272 & \">\" & TEXT(B2272,\"0.000000\") & \"</\" & A2272 & \">\"","v":"<Nozzle_Duct_Y_Offset>0.000000</Nozzle_Duct_Y_Offset>"}]
["Nozzle_Duct_Shape_Factor",0,null,{"$f":"\"<\" & A2273 & \">\" & TEXT(B2273,\"0.000000\") & \"</\" & A2273 & \">\"","v":"<Nozzle_Duct_Shape_Factor>0.000000</Nozzle_Duct_Shape_Factor>"}]
["/Engine_Parms",null,null,{"$f":"\"<\" & A2274 & \">\"","v":"</Engine_Parms>"}]
["/Component",null,{"$f":"IF(OR(C1890=\"Yes\",C1743=\"No\"),\"No\",\"Yes\")","v":"Yes"},{"$f":"IF(C2275=\"Yes\",(\"<\"&A2275&\">\"),(\"<\"&A2275&\"-->\"))","v":"</Component>"}]
["Component",{"$f":"B2279","v":"Engine 4"},{"$f":"IF(Input!$D$27>=3,\"Yes\",\"No\")","v":"No"},{"$f":"IF(C2276=\"Yes\",(\"<\"&A2276&\">\"),(\"<!--\"&A2276&\">\"))","v":"<!--Component>"}]
["Type","Blank",null,{"$f":"\"<\" & A2277 & \">\" & TEXT(B2277,0) & \"</\" & A2277 & \">\"","v":"<Type>Blank</Type>"}]
["General_Parms",null,null,{"$f":"\"<\" & A2278 & \">\"","v":"<General_Parms>"}]
["Name",{"$f":"IF(n_e=3,\"Engine 2\",\"Engine 4\")","v":"Engine 4"},null,{"$f":"\"<\" & A2279 & \">\" & TEXT(B2279,0) & \"</\" & A2279 & \">\"","v":"<Name>Engine 4</Name>"}]
["ColorR",0,null,{"$f":"\"<\" & A2280 & \">\" & TEXT(B2280,\"0.000000\") & \"</\" & A2280 & \">\"","v":"<ColorR>0.000000</ColorR>"}]
["ColorG",0,null,{"$f":"\"<\" & A2281 & \">\" & TEXT(B2281,\"0.000000\") & \"</\" & A2281 & \">\"","v":"<ColorG>0.000000</ColorG>"}]
["ColorB",255,null,{"$f":"\"<\" & A2282 & \">\" & TEXT(B2282,\"0.000000\") & \"</\" & A2282 & \">\"","v":"<ColorB>255.000000</ColorB>"}]
["Symmetry",0,null,{"$f":"\"<\" & A2283 & \">\" & TEXT(B2283,0) & \"</\" & A2283 & \">\"","v":"<Symmetry>0</Symmetry>"}]
["RelXFormFlag",0,null,"<RelXFormFlag>0</RelXFormFlag>"]
["MaterialID",2,null,"<MaterialID>2</MaterialID>"]
["OutputFlag",1,null,"<OutputFlag>1</OutputFlag>"]
["OutputNameID",0,null,"<OutputNameID>0</OutputNameID>"]
["DisplayChildrenFlag",1,null,"<DisplayChildrenFlag>1</DisplayChildrenFlag>"]
["NumPnts",21,null,"<NumPnts>21</NumPnts>"]
["NumXsecs",11,null,"<NumXsecs>11</NumXsecs>"]
["MassPrior",0,null,"<MassPrior>0</MassPrior>"]
["ShellFlag",0,null,"<ShellFlag>0</ShellFlag>"]
["Tran_X",{"$f":"IF(Type_e=\"Jet\",pos_e.j3.x,pos_e.p3.x)","v":"N/A"},null,{"$f":"\"<\" & A2293 & \">\" & TEXT(B2293,\"0.000000\") & \"</\" & A2293 & \">\"","v":"<Tran_X>N/A</Tran_X>"}]
["Tran_Y",{"$f":"IF(Type_e=\"Jet\",pos_e.j3.y,pos_e.p3.y)","v":"N/A"},null,"<Tran_Y>N/A</Tran_Y>"]
["Tran_Z",{"$f":"IF(Type_e=\"Jet\",pos_e.j3.z,pos_e.p3.z)","v":"N/A"},null,"<Tran_Z>N/A</Tran_Z>"]
["TranRel_X",0,null,"<TranRel_X>0.000000</TranRel_X>"]
["TranRel_Y",0,null,"<TranRel_Y>0.000000</TranRel_Y>"]
["TranRel_Z",0,null,"<TranRel_Z>0.000000</TranRel_Z>"]
["Rot_X",0,null,"<Rot_X>0.000000</Rot_X>"]
["Rot_Y",0,null,"<Rot_Y>0.000000</Rot_Y>"]
["Rot_Z",0,null,"<Rot_Z>0.000000</Rot_Z>"]
["RotRel_X",0,null,"<RotRel_X>0.000000</RotRel_X>"]
["RotRel_Y",0,null,"<RotRel_Y>0.000000</RotRel_Y>"]
["RotRel_Z",0,null,"<RotRel_Z>0.000000</RotRel_Z>"]
["Origin",0,null,"<Origin>0.000000</Origin>"]
["Density",1,null,"<Density>1.000000</Density>"]
["ShellMassArea",1,null,"<ShellMassArea>1.000000</ShellMassArea>"]
["RefFlag",0,null,{"$f":"\"<\" & A2308 & \">\" & TEXT(B2308,0) & \"</\" & A2308 & \">\"","v":"<RefFlag>0</RefFlag>"}]
["RefArea",100,null,{"$f":"\"<\" & A2309 & \">\" & TEXT(B2309,\"0.000000\") & \"</\" & A2309 & \">\"","v":"<RefArea>100.000000</RefArea>"}]
["RefSpan",10,null,{"$f":"\"<\" & A2310 & \">\" & TEXT(B2310,\"0.000000\") & \"</\" & A2310 & \">\"","v":"<RefSpan>10.000000</RefSpan>"}]
["RefCbar",1,null,{"$f":"\"<\" & A2311 & \">\" & TEXT(B2311,\"0.000000\") & \"</\" & A2311 & \">\"","v":"<RefCbar>1.000000</RefCbar>"}]
["AutoRefAreaFlag",1,null,{"$f":"\"<\" & A2312 & \">\" & TEXT(B2312,0) & \"</\" & A2312 & \">\"","v":"<AutoRefAreaFlag>1</AutoRefAreaFlag>"}]
["AutoRefSpanFlag",1,null,{"$f":"\"<\" & A2313 & \">\" & TEXT(B2313,0) & \"</\" & A2313 & \">\"","v":"<AutoRefSpanFlag>1</AutoRefSpanFlag>"}]
["AutoRefCbarFlag",1,null,{"$f":"\"<\" & A2314 & \">\" & TEXT(B2314,0) & \"</\" & A2314 & \">\"","v":"<AutoRefCbarFlag>1</AutoRefCbarFlag>"}]
["AeroCenter_X",0,null,{"$f":"\"<\" & A2315 & \">\" & TEXT(B2315,\"0.000000\") & \"</\" & A2315 & \">\"","v":"<AeroCenter_X>0.000000</AeroCenter_X>"}]
["AeroCenter_Y",0,null,{"$f":"\"<\" & A2316 & \">\" & TEXT(B2316,\"0.000000\") & \"</\" & A2316 & \">\"","v":"<AeroCenter_Y>0.000000</AeroCenter_Y>"}]
["AeroCenter_Z",0,null,{"$f":"\"<\" & A2317 & \">\" & TEXT(B2317,\"0.000000\") & \"</\" & A2317 & \">\"","v":"<AeroCenter_Z>0.000000</AeroCenter_Z>"}]
["AutoAeroCenterFlag",1,null,{"$f":"\"<\" & A2318 & \">\" & TEXT(B2318,0) & \"</\" & A2318 & \">\"","v":"<AutoAeroCenterFlag>1</AutoAeroCenterFlag>"}]
["WakeActiveFlag",0,null,{"$f":"\"<\" & A2319 & \">\" & TEXT(B2319,0) & \"</\" & A2319 & \">\"","v":"<WakeActiveFlag>0</WakeActiveFlag>"}]
["PosAttachFlag",0,null,{"$f":"\"<\" & A2320 & \">\" & TEXT(B2320,0) & \"</\" & A2320 & \">\"","v":"<PosAttachFlag>0</PosAttachFlag>"}]
["U_Attach",0,null,{"$f":"\"<\" & A2321 & \">\" & TEXT(B2321,\"0.000000\") & \"</\" & A2321 & \">\"","v":"<U_Attach>0.000000</U_Attach>"}]
["V_Attach",0,null,{"$f":"\"<\" & A2322 & \">\" & TEXT(B2322,\"0.000000\") & \"</\" & A2322 & \">\"","v":"<V_Attach>0.000000</V_Attach>"}]
["PtrID",149096552,null,{"$f":"\"<\" & A2323 & \">\" & TEXT(B2323,0) & \"</\" & A2323 & \">\"","v":"<PtrID>149096552</PtrID>"}]
["Parent_PtrID",0,null,"<Parent_PtrID>0</Parent_PtrID>"]
["Children_PtrID",149099136,null,"<Children_PtrID>149099136</Children_PtrID>"]
["Children_PtrID",149328112,null,"<Children_PtrID>149328112</Children_PtrID>"]
["Children_PtrID",148458298,null,"<Children_PtrID>148458298</Children_PtrID>"]
["Children_PtrID",74069,null,"<Children_PtrID>74069</Children_PtrID>"]
["/General_Parms",null,null,{"$f":"\"<\" & A2329 & \">\"","v":"</General_Parms>"}]
["Blank_Parms",null,null,{"$f":"\"<\" & A2330 & \">\"","v":"<Blank_Parms>"}]
["PointMassFlag",0,null,{"$f":"\"<\" & A2331 & \">\" & TEXT(B2331,0) & \"</\" & A2331 & \">\"","v":"<PointMassFlag>0</PointMassFlag>"}]
["PointMass",1,null,{"$f":"\"<\" & A2332 & \">\" & TEXT(B2332,\"0.000000\") & \"</\" & A2332 & \">\"","v":"<PointMass>1.000000</PointMass>"}]
["/Blank_Parms",null,null,{"$f":"\"<\" & A2333 & \">\"","v":"</Blank_Parms>"}]
["/Component",null,null,{"$f":"\"<\" & A2334 & \">\"","v":"</Component>"}]
["Component","CoreSect",null,{"$f":"\"<\" & A2335 & \">\"","v":"<Component>"}]
["Type",{"$f":"B1803","v":"Engine"},null,{"$f":"\"<\" & A2336 & \">\" & TEXT(B2336,\"0.000000\") & \"</\" & A2336 & \">\"","v":"<Type>Engine</Type>"}]
["General_Parms",null,null,{"$f":"\"<\" & A2337 & \">\"","v":"<General_Parms>"}]
["Name","core_section",null,{"$f":"\"<\" & A2338 & \">\" & TEXT(B2338,\"0.000000\") & \"</\" & A2338 & \">\"","v":"<Name>core_section</Name>"}]
["ColorR",0,null,{"$f":"\"<\" & A2339 & \">\" & TEXT(B2339,\"0.000000\") & \"</\" & A2339 & \">\"","v":"<ColorR>0.000000</ColorR>"}]
["ColorG",0,null,{"$f":"\"<\" & A2340 & \">\" & TEXT(B2340,\"0.000000\") & \"</\" & A2340 & \">\"","v":"<ColorG>0.000000</ColorG>"}]
["ColorB",0,null,{"$f":"\"<\" & A2341 & \">\" & TEXT(B2341,\"0.000000\") & \"</\" & A2341 & \">\"","v":"<ColorB>0.000000</ColorB>"}]
["Symmetry",0,null,{"$f":"\"<\" & A2342 & \">\" & TEXT(B2342,0) & \"</\" & A2342 & \">\"","v":"<Symmetry>0</Symmetry>"}]
["RelXFormFlag",0,null,"<RelXFormFlag>0</RelXFormFlag>"]
["MaterialID",2,null,"<MaterialID>2</MaterialID>"]
["OutputFlag",1,null,"<OutputFlag>1</OutputFlag>"]
["OutputNameID",0,null,"<OutputNameID>0</OutputNameID>"]
["DisplayChildrenFlag",1,null,"<DisplayChildrenFlag>1</DisplayChildrenFlag>"]
["NumPnts",21,null,"<NumPnts>21</NumPnts>"]
["NumXsecs",11,null,"<NumXsecs>11</NumXsecs>"]
["MassPrior",0,null,"<MassPrior>0</MassPrior>"]
["ShellFlag",0,null,"<ShellFlag>0</ShellFlag>"]
["Tran_X",{"$f":"IF(n_e=3, IF(Type_e = \"Jet\", c_r.V, 0), 0)","v":0},null,{"$f":"\"<\" & A2352 & \">\" & TEXT(B2352,\"0.000000\") & \"</\" & A2352 & \">\"","v":"<Tran_X>0.000000</Tran_X>"}]
["Tran_Y",0,null,"<Tran_Y>0.000000</Tran_Y>"]
["Tran_Z",0,null,"<Tran_Z>0.000000</Tran_Z>"]
["TranRel_X",0,null,"<TranRel_X>0.000000</TranRel_X>"]
["TranRel_Y",0,null,"<TranRel_Y>0.000000</TranRel_Y>"]
["TranRel_Z",0,null,"<TranRel_Z>0.000000</TranRel_Z>"]
["Rot_X",0,null,"<Rot_X>0.000000</Rot_X>"]
["Rot_Y",0,null,"<Rot_Y>0.000000</Rot_Y>"]
["Rot_Z",0,null,"<Rot_Z>0.000000</Rot_Z>"]
["RotRel_X",0,null,"<RotRel_X>0.000000</RotRel_X>"]
["RotRel_Y",0,null,"<RotRel_Y>0.000000</RotRel_Y>"]
["RotRel_Z",0,null,"<RotRel_Z>0.000000</RotRel_Z>"]
["Origin",0,null,"<Origin>0.000000</Origin>"]
["Density",1,null,"<Density>1.000000</Density>"]
["ShellMassArea",1,null,"<ShellMassArea>1.000000</ShellMassArea>"]
["RefFlag",0,null,{"$f":"\"<\" & A2367 & \">\" & TEXT(B2367,0) & \"</\" & A2367 & \">\"","v":"<RefFlag>0</RefFlag>"}]
["RefArea",100,null,{"$f":"\"<\" & A2368 & \">\" & TEXT(B2368,\"0.000000\") & \"</\" & A2368 & \">\"","v":"<RefArea>100.000000</RefArea>"}]
["RefSpan",10,null,{"$f":"\"<\" & A2369 & \">\" & TEXT(B2369,\"0.000000\") & \"</\" & A2369 & \">\"","v":"<RefSpan>10.000000</RefSpan>"}]
["RefCbar",1,null,{"$f":"\"<\" & A2370 & \">\" & TEXT(B2370,\"0.000000\") & \"</\" & A2370 & \">\"","v":"<RefCbar>1.000000</RefCbar>"}]
["AutoRefAreaFlag",1,null,{"$f":"\"<\" & A2371 & \">\" & TEXT(B2371,0) & \"</\" & A2371 & \">\"","v":"<AutoRefAreaFlag>1</AutoRefAreaFlag>"}]
["AutoRefSpanFlag",1,null,{"$f":"\"<\" & A2372 & \">\" & TEXT(B2372,0) & \"</\" & A2372 & \">\"","v":"<AutoRefSpanFlag>1</AutoRefSpanFlag>"}]
["AutoRefCbarFlag",1,null,{"$f":"\"<\" & A2373 & \">\" & TEXT(B2373,0) & \"</\" & A2373 & \">\"","v":"<AutoRefCbarFlag>1</AutoRefCbarFlag>"}]
["AeroCenter_X",0,null,{"$f":"\"<\" & A2374 & \">\" & TEXT(B2374,\"0.000000\") & \"</\" & A2374 & \">\"","v":"<AeroCenter_X>0.000000</AeroCenter_X>"}]
["AeroCenter_Y",0,null,{"$f":"\"<\" & A2375 & \">\" & TEXT(B2375,\"0.000000\") & \"</\" & A2375 & \">\"","v":"<AeroCenter_Y>0.000000</AeroCenter_Y>"}]
["AeroCenter_Z",0,null,{"$f":"\"<\" & A2376 & \">\" & TEXT(B2376,\"0.000000\") & \"</\" & A2376 & \">\"","v":"<AeroCenter_Z>0.000000</AeroCenter_Z>"}]
["AutoAeroCenterFlag",1,null,{"$f":"\"<\" & A2377 & \">\" & TEXT(B2377,0) & \"</\" & A2377 & \">\"","v":"<AutoAeroCenterFlag>1</AutoAeroCenterFlag>"}]
["WakeActiveFlag",0,null,{"$f":"\"<\" & A2378 & \">\" & TEXT(B2378,0) & \"</\" & A2378 & \">\"","v":"<WakeActiveFlag>0</WakeActiveFlag>"}]
["PosAttachFlag",3,null,{"$f":"\"<\" & A2379 & \">\" & TEXT(B2379,0) & \"</\" & A2379 & \">\"","v":"<PosAttachFlag>3</PosAttachFlag>"}]
["U_Attach",0,null,{"$f":"\"<\" & A2380 & \">\" & TEXT(B2380,\"0.000000\") & \"</\" & A2380 & \">\"","v":"<U_Attach>0.000000</U_Attach>"}]
["V_Attach",0,null,{"$f":"\"<\" & A2381 & \">\" & TEXT(B2381,\"0.000000\") & \"</\" & A2381 & \">\"","v":"<V_Attach>0.000000</V_Attach>"}]
["PtrID",149099136,null,{"$f":"\"<\" & A2382 & \">\" & TEXT(B2382,0) & \"</\" & A2382 & \">\"","v":"<PtrID>149099136</PtrID>"}]
["Parent_PtrID",149096552,null,{"$f":"\"<\" & A2383 & \">\" & TEXT(B2383,0) & \"</\" & A2383 & \">\"","v":"<Parent_PtrID>149096552</Parent_PtrID>"}]
["/General_Parms",null,null,{"$f":"\"<\" & A2384 & \">\"","v":"</General_Parms>"}]
["Engine_Parms",null,null,{"$f":"\"<\" & A2385 & \">\"","v":"<Engine_Parms>"}]
["Engine_Type",{"$f":"B1853","v":0},null,{"$f":"\"<\" & A2386 & \">\" & TEXT(B2386,0) & \"</\" & A2386 & \">\"","v":"<Engine_Type>0</Engine_Type>"}]
["Radius_Tip",0.84499999999999997,null,{"$f":"\"<\" & A2387 & \">\" & TEXT(B2387,\"0.000000\") & \"</\" & A2387 & \">\"","v":"<Radius_Tip>0.845000</Radius_Tip>"}]
["Max_Tip",1.3,null,{"$f":"\"<\" & A2388 & \">\" & TEXT(B2388,\"0.000000\") & \"</\" & A2388 & \">\"","v":"<Max_Tip>1.300000</Max_Tip>"}]
["Hub_Tip",0.5,null,{"$f":"\"<\" & A2389 & \">\" & TEXT(B2389,\"0.000000\") & \"</\" & A2389 & \">\"","v":"<Hub_Tip>0.500000</Hub_Tip>"}]
["Eng_Length",0,null,{"$f":"\"<\" & A2390 & \">\" & TEXT(B2390,\"0.000000\") & \"</\" & A2390 & \">\"","v":"<Eng_Length>0.000000</Eng_Length>"}]
["Inlet_Type",1,null,{"$f":"\"<\" & A2391 & \">\" & TEXT(B2391,0) & \"</\" & A2391 & \">\"","v":"<Inlet_Type>1</Inlet_Type>"}]
["Inl_Noz_Color",0,null,{"$f":"\"<\" & A2392 & \">\" & TEXT(B2392,0) & \"</\" & A2392 & \">\"","v":"<Inl_Noz_Color>0</Inl_Noz_Color>"}]
["Inlet_XY_Sym_Flag",0,null,{"$f":"\"<\" & A2393 & \">\" & TEXT(B2393,0) & \"</\" & A2393 & \">\"","v":"<Inlet_XY_Sym_Flag>0</Inlet_XY_Sym_Flag>"}]
["Inlet_Half_Split_Flag",0,null,{"$f":"\"<\" & A2394 & \">\" & TEXT(B2394,0) & \"</\" & A2394 & \">\"","v":"<Inlet_Half_Split_Flag>0</Inlet_Half_Split_Flag>"}]
["Cowl_Length",1E-3,null,{"$f":"\"<\" & A2395 & \">\" & TEXT(B2395,\"0.000000\") & \"</\" & A2395 & \">\"","v":"<Cowl_Length>0.001000</Cowl_Length>"}]
["Eng_Thrt_Ratio",1.5,null,"<Eng_Thrt_Ratio>1.500000</Eng_Thrt_Ratio>"]
["Hilight_Thrt_Ratio",1.3,null,"<Hilight_Thrt_Ratio>1.300000</Hilight_Thrt_Ratio>"]
["Lip_Finess_Ratio",1.9,null,"<Lip_Finess_Ratio>1.900000</Lip_Finess_Ratio>"]
["Height_Width_Ratio",1,null,"<Height_Width_Ratio>1.000000</Height_Width_Ratio>"]
["Upper_Surf_Shape_Factor",-1.3,null,"<Upper_Surf_Shape_Factor>-1.300000</Upper_Surf_Shape_Factor>"]
["Lower_Surf_Shape_Factor",0.7,null,"<Lower_Surf_Shape_Factor>0.700000</Lower_Surf_Shape_Factor>"]
["Inlet_X_Axis_Rot",0,null,"<Inlet_X_Axis_Rot>0.000000</Inlet_X_Axis_Rot>"]
["Inlet_Scarf_Angle",0,null,"<Inlet_Scarf_Angle>0.000000</Inlet_Scarf_Angle>"]
["Inlet_Duct_On_Off",0,null,{"$f":"\"<\" & A2404 & \">\" & TEXT(B2404,0) & \"</\" & A2404 & \">\"","v":"<Inlet_Duct_On_Off>0</Inlet_Duct_On_Off>"}]
["Inlet_Duct_X_Offset",3,null,{"$f":"\"<\" & A2405 & \">\" & TEXT(B2405,\"0.000000\") & \"</\" & A2405 & \">\"","v":"<Inlet_Duct_X_Offset>3.000000</Inlet_Duct_X_Offset>"}]
["Inlet_Duct_Y_Offset",1,null,{"$f":"\"<\" & A2406 & \">\" & TEXT(B2406,\"0.000000\") & \"</\" & A2406 & \">\"","v":"<Inlet_Duct_Y_Offset>1.000000</Inlet_Duct_Y_Offset>"}]
["Inlet_Duct_Shape_Factor",0.5,null,{"$f":"\"<\" & A2407 & \">\" & TEXT(B2407,\"0.000000\") & \"</\" & A2407 & \">\"","v":"<Inlet_Duct_Shape_Factor>0.500000</Inlet_Duct_Shape_Factor>"}]
["Divertor_On_Off",0,null,{"$f":"\"<\" & A2408 & \">\" & TEXT(B2408,0) & \"</\" & A2408 & \">\"","v":"<Divertor_On_Off>0</Divertor_On_Off>"}]
["Divertor_Height",0.5,null,{"$f":"\"<\" & A2409 & \">\" & TEXT(B2409,\"0.000000\") & \"</\" & A2409 & \">\"","v":"<Divertor_Height>0.500000</Divertor_Height>"}]
["Divertor_Length",1,null,{"$f":"\"<\" & A2410 & \">\" & TEXT(B2410,\"0.000000\") & \"</\" & A2410 & \">\"","v":"<Divertor_Length>1.000000</Divertor_Length>"}]
["Nozzle_Type",0,null,{"$f":"\"<\" & A2411 & \">\" & TEXT(B2411,0) & \"</\" & A2411 & \">\"","v":"<Nozzle_Type>0</Nozzle_Type>"}]
["Nozzle_Length",{"$f":"IF(Type_e=\"Jet\",l_e.j/B2387,l_e.p/B2387)","v":5.4907500000000011},null,{"$f":"\"<\" & A2412 & \">\" & TEXT(B2412,\"0.000000\") & \"</\" & A2412 & \">\"","v":"<Nozzle_Length>5.490750</Nozzle_Length>"}]
["Exit_Area_Ratio",{"$f":"B1880","v":3},null,{"$f":"\"<\" & A2413 & \">\" & TEXT(B2413,\"0.000000\") & \"</\" & A2413 & \">\"","v":"<Exit_Area_Ratio>3.000000</Exit_Area_Ratio>"}]
["Nozzle_Height_Width_Ratio",1,null,{"$f":"\"<\" & A2414 & \">\" & TEXT(B2414,\"0.000000\") & \"</\" & A2414 & \">\"","v":"<Nozzle_Height_Width_Ratio>1.000000</Nozzle_Height_Width_Ratio>"}]
["Exit_Throat_Ratio",1.5,null,{"$f":"\"<\" & A2415 & \">\" & TEXT(B2415,\"0.000000\") & \"</\" & A2415 & \">\"","v":"<Exit_Throat_Ratio>1.500000</Exit_Throat_Ratio>"}]
["Dive_Flap_Ratio",1,null,{"$f":"\"<\" & A2416 & \">\" & TEXT(B2416,\"0.000000\") & \"</\" & A2416 & \">\"","v":"<Dive_Flap_Ratio>1.000000</Dive_Flap_Ratio>"}]
["Nozzle_Duct_On_Off",0,null,{"$f":"\"<\" & A2417 & \">\" & TEXT(B2417,0) & \"</\" & A2417 & \">\"","v":"<Nozzle_Duct_On_Off>0</Nozzle_Duct_On_Off>"}]
["Nozzle_Duct_X_Offset",1,null,{"$f":"\"<\" & A2418 & \">\" & TEXT(B2418,\"0.000000\") & \"</\" & A2418 & \">\"","v":"<Nozzle_Duct_X_Offset>1.000000</Nozzle_Duct_X_Offset>"}]
["Nozzle_Duct_Y_Offset",0,null,{"$f":"\"<\" & A2419 & \">\" & TEXT(B2419,\"0.000000\") & \"</\" & A2419 & \">\"","v":"<Nozzle_Duct_Y_Offset>0.000000</Nozzle_Duct_Y_Offset>"}]
["Nozzle_Duct_Shape_Factor",0,null,{"$f":"\"<\" & A2420 & \">\" & TEXT(B2420,\"0.000000\") & \"</\" & A2420 & \">\"","v":"<Nozzle_Duct_Shape_Factor>0.000000</Nozzle_Duct_Shape_Factor>"}]
["/Engine_Parms",null,null,{"$f":"\"<\" & A2421 & \">\"","v":"</Engine_Parms>"}]
["/Component",null,null,{"$f":"\"<\" & A2422 & \">\"","v":"</Component>"}]
["Component","Prop Rotor",{"$f":"IF(Input!D27>=3,IF(Input!$D$26=\"Jet\",\"No\",\"Yes\"),\"Yes\")","v":"Yes"},{"$f":"IF(C2423=\"Yes\",(\"<\"&A2423&\">\"),(\"<!--\"&A2423&\">\"))","v":"<Component>"}]
["Type","Prop",null,{"$f":"\"<\" & A2424 & \">\" & TEXT(B2424,\"0.000000\") & \"</\" & A2424 & \">\"","v":"<Type>Prop</Type>"}]
["General_Parms",null,null,{"$f":"\"<\" & A2425 & \">\"","v":"<General_Parms>"}]
["Name",{"$f":"B1893","v":"Rotor"},null,{"$f":"\"<\" & A2426 & \">\" & TEXT(B2426,\"0.000000\") & \"</\" & A2426 & \">\"","v":"<Name>Rotor</Name>"}]
["ColorR",127,null,{"$f":"\"<\" & A2427 & \">\" & TEXT(B2427,\"0.000000\") & \"</\" & A2427 & \">\"","v":"<ColorR>127.000000</ColorR>"}]
["ColorG",127,null,{"$f":"\"<\" & A2428 & \">\" & TEXT(B2428,\"0.000000\") & \"</\" & A2428 & \">\"","v":"<ColorG>127.000000</ColorG>"}]
["ColorB",127,null,{"$f":"\"<\" & A2429 & \">\" & TEXT(B2429,\"0.000000\") & \"</\" & A2429 & \">\"","v":"<ColorB>127.000000</ColorB>"}]
["Symmetry",0,null,{"$f":"\"<\" & A2430 & \">\" & TEXT(B2430,0) & \"</\" & A2430 & \">\"","v":"<Symmetry>0</Symmetry>"}]
["RelXFormFlag",0,null,"<RelXFormFlag>0</RelXFormFlag>"]
["MaterialID",0,null,"<MaterialID>0</MaterialID>"]
["OutputFlag",1,null,"<OutputFlag>1</OutputFlag>"]
["OutputNameID",0,null,"<OutputNameID>0</OutputNameID>"]
["DisplayChildrenFlag",1,null,"<DisplayChildrenFlag>1</DisplayChildrenFlag>"]
["NumPnts",21,null,"<NumPnts>21</NumPnts>"]
["NumXsecs",11,null,"<NumXsecs>11</NumXsecs>"]
["MassPrior",0,null,"<MassPrior>0</MassPrior>"]
["ShellFlag",0,null,"<ShellFlag>0</ShellFlag>"]
["Tran_X",0,null,{"$f":"\"<\" & A2440 & \">\" & TEXT(B2440,\"0.000000\") & \"</\" & A2440 & \">\"","v":"<Tran_X>0.000000</Tran_X>"}]
["Tran_Y",0,null,"<Tran_Y>0.000000</Tran_Y>"]
["Tran_Z",0,null,"<Tran_Z>0.000000</Tran_Z>"]
["TranRel_X",0,null,"<TranRel_X>0.000000</TranRel_X>"]
["TranRel_Y",0,null,"<TranRel_Y>0.000000</TranRel_Y>"]
["TranRel_Z",0,null,"<TranRel_Z>0.000000</TranRel_Z>"]
["Rot_X",0,null,"<Rot_X>0.000000</Rot_X>"]
["Rot_Y",0,null,"<Rot_Y>0.000000</Rot_Y>"]
["Rot_Z",0,null,"<Rot_Z>0.000000</Rot_Z>"]
["RotRel_X",0,null,"<RotRel_X>0.000000</RotRel_X>"]
["RotRel_Y",0,null,"<RotRel_Y>0.000000</RotRel_Y>"]
["RotRel_Z",0,null,"<RotRel_Z>0.000000</RotRel_Z>"]
["Origin",0,null,"<Origin>0.000000</Origin>"]
["Density",1,null,"<Density>1.000000</Density>"]
["ShellMassArea",1,null,"<ShellMassArea>1.000000</ShellMassArea>"]
["RefFlag",0,null,{"$f":"\"<\" & A2455 & \">\" & TEXT(B2455,0) & \"</\" & A2455 & \">\"","v":"<RefFlag>0</RefFlag>"}]
["RefArea",100,null,{"$f":"\"<\" & A2456 & \">\" & TEXT(B2456,\"0.000000\") & \"</\" & A2456 & \">\"","v":"<RefArea>100.000000</RefArea>"}]
["RefSpan",10,null,{"$f":"\"<\" & A2457 & \">\" & TEXT(B2457,\"0.000000\") & \"</\" & A2457 & \">\"","v":"<RefSpan>10.000000</RefSpan>"}]
["RefCbar",1,null,{"$f":"\"<\" & A2458 & \">\" & TEXT(B2458,\"0.000000\") & \"</\" & A2458 & \">\"","v":"<RefCbar>1.000000</RefCbar>"}]
["AutoRefAreaFlag",1,null,{"$f":"\"<\" & A2459 & \">\" & TEXT(B2459,0) & \"</\" & A2459 & \">\"","v":"<AutoRefAreaFlag>1</AutoRefAreaFlag>"}]
["AutoRefSpanFlag",1,null,{"$f":"\"<\" & A2460 & \">\" & TEXT(B2460,0) & \"</\" & A2460 & \">\"","v":"<AutoRefSpanFlag>1</AutoRefSpanFlag>"}]
["AutoRefCbarFlag",1,null,{"$f":"\"<\" & A2461 & \">\" & TEXT(B2461,0) & \"</\" & A2461 & \">\"","v":"<AutoRefCbarFlag>1</AutoRefCbarFlag>"}]
["AeroCenter_X",0,null,{"$f":"\"<\" & A2462 & \">\" & TEXT(B2462,\"0.000000\") & \"</\" & A2462 & \">\"","v":"<AeroCenter_X>0.000000</AeroCenter_X>"}]
["AeroCenter_Y",0,null,{"$f":"\"<\" & A2463 & \">\" & TEXT(B2463,\"0.000000\") & \"</\" & A2463 & \">\"","v":"<AeroCenter_Y>0.000000</AeroCenter_Y>"}]
["AeroCenter_Z",0,null,{"$f":"\"<\" & A2464 & \">\" & TEXT(B2464,\"0.000000\") & \"</\" & A2464 & \">\"","v":"<AeroCenter_Z>0.000000</AeroCenter_Z>"}]
["AutoAeroCenterFlag",1,null,{"$f":"\"<\" & A2465 & \">\" & TEXT(B2465,0) & \"</\" & A2465 & \">\"","v":"<AutoAeroCenterFlag>1</AutoAeroCenterFlag>"}]
["WakeActiveFlag",0,null,{"$f":"\"<\" & A2466 & \">\" & TEXT(B2466,0) & \"</\" & A2466 & \">\"","v":"<WakeActiveFlag>0</WakeActiveFlag>"}]
["PosAttachFlag",3,null,{"$f":"\"<\" & A2467 & \">\" & TEXT(B2467,0) & \"</\" & A2467 & \">\"","v":"<PosAttachFlag>3</PosAttachFlag>"}]
["U_Attach",0,null,{"$f":"\"<\" & A2468 & \">\" & TEXT(B2468,\"0.000000\") & \"</\" & A2468 & \">\"","v":"<U_Attach>0.000000</U_Attach>"}]
["V_Attach",0,null,{"$f":"\"<\" & A2469 & \">\" & TEXT(B2469,\"0.000000\") & \"</\" & A2469 & \">\"","v":"<V_Attach>0.000000</V_Attach>"}]
["PtrID",74069,null,{"$f":"\"<\" & A2470 & \">\" & TEXT(B2470,0) & \"</\" & A2470 & \">\"","v":"<PtrID>74069</PtrID>"}]
["Parent_PtrID",149096552,null,{"$f":"\"<\" & A2471 & \">\" & TEXT(B2471,0) & \"</\" & A2471 & \">\"","v":"<Parent_PtrID>149096552</Parent_PtrID>"}]
["/General_Parms",null,null,{"$f":"\"<\" & A2472 & \">\"","v":"</General_Parms>"}]
["Prop_Parms",null,null,{"$f":"\"<\" & A2473 & \">\"","v":"<Prop_Parms>"}]
["NumBlades",{"$f":"B1941","v":6},null,{"$f":"\"<\" & A2474 & \">\" & TEXT(B2474,0) & \"</\" & A2474 & \">\"","v":"<NumBlades>6</NumBlades>"}]
["SmoothFlag",1,null,{"$f":"\"<\" & A2475 & \">\" & TEXT(B2475,0) & \"</\" & A2475 & \">\"","v":"<SmoothFlag>1</SmoothFlag>"}]
["NumU",3,null,{"$f":"\"<\" & A2476 & \">\" & TEXT(B2476,0) & \"</\" & A2476 & \">\"","v":"<NumU>3</NumU>"}]
["NumW",1,null,{"$f":"\"<\" & A2477 & \">\" & TEXT(B2477,0) & \"</\" & A2477 & \">\"","v":"<NumW>1</NumW>"}]
["Diameter",3.8910028638910115,null,{"$f":"\"<\" & A2478 & \">\" & TEXT(B2478,\"0.000000\") & \"</\" & A2478 & \">\"","v":"<Diameter>3.891003</Diameter>"}]
["ConeAngle",0,null,{"$f":"\"<\" & A2479 & \">\" & TEXT(B2479,\"0.000000\") & \"</\" & A2479 & \">\"","v":"<ConeAngle>0.000000</ConeAngle>"}]
["Pitch",0,null,{"$f":"\"<\" & A2480 & \">\" & TEXT(B2480,\"0.000000\") & \"</\" & A2480 & \">\"","v":"<Pitch>0.000000</Pitch>"}]
["Sect_Parms","Section0",null,{"$f":"\"<\" & A2481 & \">\"","v":"<Sect_Parms>"}]
["X_Off",0.05,null,{"$f":"\"<\" & A2482 & \">\" & TEXT(B2482,\"0.000000\") & \"</\" & A2482 & \">\"","v":"<X_Off>0.050000</X_Off>"}]
["Y_Off",0,null,{"$f":"\"<\" & A2483 & \">\" & TEXT(B2483,\"0.000000\") & \"</\" & A2483 & \">\"","v":"<Y_Off>0.000000</Y_Off>"}]
["Chord",0.08,null,{"$f":"\"<\" & A2484 & \">\" & TEXT(B2484,\"0.000000\") & \"</\" & A2484 & \">\"","v":"<Chord>0.080000</Chord>"}]
["Twist",45,null,{"$f":"\"<\" & A2485 & \">\" & TEXT(B2485,\"0.000000\") & \"</\" & A2485 & \">\"","v":"<Twist>45.000000</Twist>"}]
["Airfoil",null,null,{"$f":"\"<\" & A2486 & \">\"","v":"<Airfoil>"}]
["Type",{"$f":"B1954","v":1},null,{"$f":"\"<\" & A2487 & \">\" & TEXT(B2487,0) & \"</\" & A2487 & \">\"","v":"<Type>1</Type>"}]
["Inverted_Flag",0,null,{"$f":"\"<\" & A2488 & \">\" & TEXT(B2488,0) & \"</\" & A2488 & \">\"","v":"<Inverted_Flag>0</Inverted_Flag>"}]
["Camber",0,null,{"$f":"\"<\" & A2489 & \">\" & TEXT(B2489,\"0.000000\") & \"</\" & A2489 & \">\"","v":"<Camber>0.000000</Camber>"}]
["Camber_Loc",0.5,null,"<Camber_Loc>0.500000</Camber_Loc>"]
["Thickness",0.2,null,"<Thickness>0.200000</Thickness>"]
["Thickness_Loc",0.3,null,"<Thickness_Loc>0.300000</Thickness_Loc>"]
["Radius_Le",4.4075999999999997E-2,null,"<Radius_Le>0.044076</Radius_Le>"]
["Radius_Te",0,null,"<Radius_Te>0.000000</Radius_Te>"]
["Six_Series",63,null,{"$f":"\"<\" & A2495 & \">\" & TEXT(B2495,0) & \"</\" & A2495 & \">\"","v":"<Six_Series>63</Six_Series>"}]
["Ideal_Cl",0,null,{"$f":"\"<\" & A2496 & \">\" & TEXT(B2496,\"0.000000\") & \"</\" & A2496 & \">\"","v":"<Ideal_Cl>0.000000</Ideal_Cl>"}]
["A",0,null,{"$f":"\"<\" & A2497 & \">\" & TEXT(B2497,\"0.000000\") & \"</\" & A2497 & \">\"","v":"<A>0.000000</A>"}]
["Slat_Flag",0,null,{"$f":"\"<\" & A2498 & \">\" & TEXT(B2498,0) & \"</\" & A2498 & \">\"","v":"<Slat_Flag>0</Slat_Flag>"}]
["Slat_Shear_Flag",0,null,{"$f":"\"<\" & A2499 & \">\" & TEXT(B2499,0) & \"</\" & A2499 & \">\"","v":"<Slat_Shear_Flag>0</Slat_Shear_Flag>"}]
["Slat_Chord",0.25,null,{"$f":"\"<\" & A2500 & \">\" & TEXT(B2500,\"0.000000\") & \"</\" & A2500 & \">\"","v":"<Slat_Chord>0.250000</Slat_Chord>"}]
["Slat_Angle",10,null,{"$f":"\"<\" & A2501 & \">\" & TEXT(B2501,\"0.000000\") & \"</\" & A2501 & \">\"","v":"<Slat_Angle>10.000000</Slat_Angle>"}]
["Flap_Flag",0,null,{"$f":"\"<\" & A2502 & \">\" & TEXT(B2502,0) & \"</\" & A2502 & \">\"","v":"<Flap_Flag>0</Flap_Flag>"}]
["Flap_Shear_Flag",0,null,{"$f":"\"<\" & A2503 & \">\" & TEXT(B2503,0) & \"</\" & A2503 & \">\"","v":"<Flap_Shear_Flag>0</Flap_Shear_Flag>"}]
["Flap_Chord",0.25,null,{"$f":"\"<\" & A2504 & \">\" & TEXT(B2504,\"0.000000\") & \"</\" & A2504 & \">\"","v":"<Flap_Chord>0.250000</Flap_Chord>"}]
["Flap_Angle",10,null,{"$f":"\"<\" & A2505 & \">\" & TEXT(B2505,\"0.000000\") & \"</\" & A2505 & \">\"","v":"<Flap_Angle>10.000000</Flap_Angle>"}]
["/Airfoil",null,null,{"$f":"\"<\" & A2506 & \">\"","v":"</Airfoil>"}]
["/Sect_Parms",null,null,{"$f":"\"<\" & A2507 & \">\"","v":"</Sect_Parms>"}]
["Sect_Parms","Section1",null,{"$f":"\"<\" & A2508 & \">\"","v":"<Sect_Parms>"}]
["X_Off",{"$f":"B1976","v":0.5},null,{"$f":"\"<\" & A2509 & \">\" & TEXT(B2509,\"0.000000\") & \"</\" & A2509 & \">\"","v":"<X_Off>0.500000</X_Off>"}]
["Y_Off",{"$f":"B1977","v":0},null,{"$f":"\"<\" & A2510 & \">\" & TEXT(B2510,\"0.000000\") & \"</\" & A2510 & \">\"","v":"<Y_Off>0.000000</Y_Off>"}]
["Chord",{"$f":"B1978","v":0.12},null,{"$f":"\"<\" & A2511 & \">\" & TEXT(B2511,\"0.000000\") & \"</\" & A2511 & \">\"","v":"<Chord>0.120000</Chord>"}]
["Twist",{"$f":"B1979","v":15},null,{"$f":"\"<\" & A2512 & \">\" & TEXT(B2512,\"0.000000\") & \"</\" & A2512 & \">\"","v":"<Twist>15.000000</Twist>"}]
["Airfoil",null,null,{"$f":"\"<\" & A2513 & \">\"","v":"<Airfoil>"}]
["Type",{"$f":"B1981","v":1},null,{"$f":"\"<\" & A2514 & \">\" & TEXT(B2514,0) & \"</\" & A2514 & \">\"","v":"<Type>1</Type>"}]
["Inverted_Flag",0,null,{"$f":"\"<\" & A2515 & \">\" & TEXT(B2515,0) & \"</\" & A2515 & \">\"","v":"<Inverted_Flag>0</Inverted_Flag>"}]
["Camber",0,null,{"$f":"\"<\" & A2516 & \">\" & TEXT(B2516,\"0.000000\") & \"</\" & A2516 & \">\"","v":"<Camber>0.000000</Camber>"}]
["Camber_Loc",0.5,null,"<Camber_Loc>0.500000</Camber_Loc>"]
["Thickness",0.2,null,"<Thickness>0.200000</Thickness>"]
["Thickness_Loc",0.3,null,"<Thickness_Loc>0.300000</Thickness_Loc>"]
["Radius_Le",4.4075999999999997E-2,null,"<Radius_Le>0.044076</Radius_Le>"]
["Radius_Te",0,null,"<Radius_Te>0.000000</Radius_Te>"]
["Six_Series",63,null,{"$f":"\"<\" & A2522 & \">\" & TEXT(B2522,0) & \"</\" & A2522 & \">\"","v":"<Six_Series>63</Six_Series>"}]
["Ideal_Cl",0,null,{"$f":"\"<\" & A2523 & \">\" & TEXT(B2523,\"0.000000\") & \"</\" & A2523 & \">\"","v":"<Ideal_Cl>0.000000</Ideal_Cl>"}]
["A",0,null,{"$f":"\"<\" & A2524 & \">\" & TEXT(B2524,\"0.000000\") & \"</\" & A2524 & \">\"","v":"<A>0.000000</A>"}]
["Slat_Flag",0,null,{"$f":"\"<\" & A2525 & \">\" & TEXT(B2525,0) & \"</\" & A2525 & \">\"","v":"<Slat_Flag>0</Slat_Flag>"}]
["Slat_Shear_Flag",0,null,{"$f":"\"<\" & A2526 & \">\" & TEXT(B2526,0) & \"</\" & A2526 & \">\"","v":"<Slat_Shear_Flag>0</Slat_Shear_Flag>"}]
["Slat_Chord",0.25,null,{"$f":"\"<\" & A2527 & \">\" & TEXT(B2527,\"0.000000\") & \"</\" & A2527 & \">\"","v":"<Slat_Chord>0.250000</Slat_Chord>"}]
["Slat_Angle",10,null,{"$f":"\"<\" & A2528 & \">\" & TEXT(B2528,\"0.000000\") & \"</\" & A2528 & \">\"","v":"<Slat_Angle>10.000000</Slat_Angle>"}]
["Flap_Flag",0,null,{"$f":"\"<\" & A2529 & \">\" & TEXT(B2529,0) & \"</\" & A2529 & \">\"","v":"<Flap_Flag>0</Flap_Flag>"}]
["Flap_Shear_Flag",0,null,{"$f":"\"<\" & A2530 & \">\" & TEXT(B2530,0) & \"</\" & A2530 & \">\"","v":"<Flap_Shear_Flag>0</Flap_Shear_Flag>"}]
["Flap_Chord",0.25,null,{"$f":"\"<\" & A2531 & \">\" & TEXT(B2531,\"0.000000\") & \"</\" & A2531 & \">\"","v":"<Flap_Chord>0.250000</Flap_Chord>"}]
["Flap_Angle",10,null,{"$f":"\"<\" & A2532 & \">\" & TEXT(B2532,\"0.000000\") & \"</\" & A2532 & \">\"","v":"<Flap_Angle>10.000000</Flap_Angle>"}]
["/Airfoil",null,null,{"$f":"\"<\" & A2533 & \">\"","v":"</Airfoil>"}]
["/Sect_Parms",null,null,{"$f":"\"<\" & A2534 & \">\"","v":"</Sect_Parms>"}]
["Sect_Parms","Section2",null,{"$f":"\"<\" & A2535 & \">\"","v":"<Sect_Parms>"}]
["X_Off",{"$f":"B2003","v":0.9},null,{"$f":"\"<\" & A2536 & \">\" & TEXT(B2536,\"0.000000\") & \"</\" & A2536 & \">\"","v":"<X_Off>0.900000</X_Off>"}]
["Y_Off",{"$f":"B2004","v":0},null,{"$f":"\"<\" & A2537 & \">\" & TEXT(B2537,\"0.000000\") & \"</\" & A2537 & \">\"","v":"<Y_Off>0.000000</Y_Off>"}]
["Chord",{"$f":"B2005","v":7.0000000000000007E-2},null,{"$f":"\"<\" & A2538 & \">\" & TEXT(B2538,\"0.000000\") & \"</\" & A2538 & \">\"","v":"<Chord>0.070000</Chord>"}]
["Twist",{"$f":"B2006","v":5},null,{"$f":"\"<\" & A2539 & \">\" & TEXT(B2539,\"0.000000\") & \"</\" & A2539 & \">\"","v":"<Twist>5.000000</Twist>"}]
["Airfoil",null,null,{"$f":"\"<\" & A2540 & \">\"","v":"<Airfoil>"}]
["Type",{"$f":"B2008","v":1},null,{"$f":"\"<\" & A2541 & \">\" & TEXT(B2541,0) & \"</\" & A2541 & \">\"","v":"<Type>1</Type>"}]
["Inverted_Flag",0,null,{"$f":"\"<\" & A2542 & \">\" & TEXT(B2542,0) & \"</\" & A2542 & \">\"","v":"<Inverted_Flag>0</Inverted_Flag>"}]
["Camber",0,null,{"$f":"\"<\" & A2543 & \">\" & TEXT(B2543,\"0.000000\") & \"</\" & A2543 & \">\"","v":"<Camber>0.000000</Camber>"}]
["Camber_Loc",0.5,null,"<Camber_Loc>0.500000</Camber_Loc>"]
["Thickness",0.2,null,"<Thickness>0.200000</Thickness>"]
["Thickness_Loc",0.3,null,"<Thickness_Loc>0.300000</Thickness_Loc>"]
["Radius_Le",4.4075999999999997E-2,null,"<Radius_Le>0.044076</Radius_Le>"]
["Radius_Te",0,null,"<Radius_Te>0.000000</Radius_Te>"]
["Six_Series",63,null,{"$f":"\"<\" & A2549 & \">\" & TEXT(B2549,0) & \"</\" & A2549 & \">\"","v":"<Six_Series>63</Six_Series>"}]
["Ideal_Cl",0,null,{"$f":"\"<\" & A2550 & \">\" & TEXT(B2550,\"0.000000\") & \"</\" & A2550 & \">\"","v":"<Ideal_Cl>0.000000</Ideal_Cl>"}]
["A",0,null,{"$f":"\"<\" & A2551 & \">\" & TEXT(B2551,\"0.000000\") & \"</\" & A2551 & \">\"","v":"<A>0.000000</A>"}]
["Slat_Flag",0,null,{"$f":"\"<\" & A2552 & \">\" & TEXT(B2552,0) & \"</\" & A2552 & \">\"","v":"<Slat_Flag>0</Slat_Flag>"}]
["Slat_Shear_Flag",0,null,{"$f":"\"<\" & A2553 & \">\" & TEXT(B2553,0) & \"</\" & A2553 & \">\"","v":"<Slat_Shear_Flag>0</Slat_Shear_Flag>"}]
["Slat_Chord",0.25,null,{"$f":"\"<\" & A2554 & \">\" & TEXT(B2554,\"0.000000\") & \"</\" & A2554 & \">\"","v":"<Slat_Chord>0.250000</Slat_Chord>"}]
["Slat_Angle",10,null,{"$f":"\"<\" & A2555 & \">\" & TEXT(B2555,\"0.000000\") & \"</\" & A2555 & \">\"","v":"<Slat_Angle>10.000000</Slat_Angle>"}]
["Flap_Flag",0,null,{"$f":"\"<\" & A2556 & \">\" & TEXT(B2556,0) & \"</\" & A2556 & \">\"","v":"<Flap_Flag>0</Flap_Flag>"}]
["Flap_Shear_Flag",0,null,{"$f":"\"<\" & A2557 & \">\" & TEXT(B2557,0) & \"</\" & A2557 & \">\"","v":"<Flap_Shear_Flag>0</Flap_Shear_Flag>"}]
["Flap_Chord",0.25,null,{"$f":"\"<\" & A2558 & \">\" & TEXT(B2558,\"0.000000\") & \"</\" & A2558 & \">\"","v":"<Flap_Chord>0.250000</Flap_Chord>"}]
["Flap_Angle",10,null,{"$f":"\"<\" & A2559 & \">\" & TEXT(B2559,\"0.000000\") & \"</\" & A2559 & \">\"","v":"<Flap_Angle>10.000000</Flap_Angle>"}]
["/Airfoil",null,null,{"$f":"\"<\" & A2560 & \">\"","v":"</Airfoil>"}]
["/Sect_Parms",null,null,{"$f":"\"<\" & A2561 & \">\"","v":"</Sect_Parms>"}]
["Sect_Parms","Section3",null,{"$f":"\"<\" & A2562 & \">\"","v":"<Sect_Parms>"}]
["X_Off",{"$f":"B2030","v":1},null,{"$f":"\"<\" & A2563 & \">\" & TEXT(B2563,\"0.000000\") & \"</\" & A2563 & \">\"","v":"<X_Off>1.000000</X_Off>"}]
["Y_Off",0,null,{"$f":"\"<\" & A2564 & \">\" & TEXT(B2564,\"0.000000\") & \"</\" & A2564 & \">\"","v":"<Y_Off>0.000000</Y_Off>"}]
["Chord",0.02,null,{"$f":"\"<\" & A2565 & \">\" & TEXT(B2565,\"0.000000\") & \"</\" & A2565 & \">\"","v":"<Chord>0.020000</Chord>"}]
["Twist",2,null,{"$f":"\"<\" & A2566 & \">\" & TEXT(B2566,\"0.000000\") & \"</\" & A2566 & \">\"","v":"<Twist>2.000000</Twist>"}]
["Airfoil",0,null,{"$f":"\"<\" & A2567 & \">\"","v":"<Airfoil>"}]
["Type",1,null,{"$f":"\"<\" & A2568 & \">\" & TEXT(B2568,0) & \"</\" & A2568 & \">\"","v":"<Type>1</Type>"}]
["Inverted_Flag",0,null,{"$f":"\"<\" & A2569 & \">\" & TEXT(B2569,0) & \"</\" & A2569 & \">\"","v":"<Inverted_Flag>0</Inverted_Flag>"}]
["Camber",0,null,{"$f":"\"<\" & A2570 & \">\" & TEXT(B2570,\"0.000000\") & \"</\" & A2570 & \">\"","v":"<Camber>0.000000</Camber>"}]
["Camber_Loc",0.5,null,"<Camber_Loc>0.500000</Camber_Loc>"]
["Thickness",0.2,null,"<Thickness>0.200000</Thickness>"]
["Thickness_Loc",0.3,null,"<Thickness_Loc>0.300000</Thickness_Loc>"]
["Radius_Le",4.4075999999999997E-2,null,"<Radius_Le>0.044076</Radius_Le>"]
["Radius_Te",0,null,"<Radius_Te>0.000000</Radius_Te>"]
["Six_Series",63,null,{"$f":"\"<\" & A2576 & \">\" & TEXT(B2576,0) & \"</\" & A2576 & \">\"","v":"<Six_Series>63</Six_Series>"}]
["Ideal_Cl",0,null,{"$f":"\"<\" & A2577 & \">\" & TEXT(B2577,\"0.000000\") & \"</\" & A2577 & \">\"","v":"<Ideal_Cl>0.000000</Ideal_Cl>"}]
["A",0,null,{"$f":"\"<\" & A2578 & \">\" & TEXT(B2578,\"0.000000\") & \"</\" & A2578 & \">\"","v":"<A>0.000000</A>"}]
["Slat_Flag",0,null,{"$f":"\"<\" & A2579 & \">\" & TEXT(B2579,0) & \"</\" & A2579 & \">\"","v":"<Slat_Flag>0</Slat_Flag>"}]
["Slat_Shear_Flag",0,null,{"$f":"\"<\" & A2580 & \">\" & TEXT(B2580,0) & \"</\" & A2580 & \">\"","v":"<Slat_Shear_Flag>0</Slat_Shear_Flag>"}]
["Slat_Chord",0.25,null,{"$f":"\"<\" & A2581 & \">\" & TEXT(B2581,\"0.000000\") & \"</\" & A2581 & \">\"","v":"<Slat_Chord>0.250000</Slat_Chord>"}]
["Slat_Angle",10,null,{"$f":"\"<\" & A2582 & \">\" & TEXT(B2582,\"0.000000\") & \"</\" & A2582 & \">\"","v":"<Slat_Angle>10.000000</Slat_Angle>"}]
["Flap_Flag",0,null,{"$f":"\"<\" & A2583 & \">\" & TEXT(B2583,0) & \"</\" & A2583 & \">\"","v":"<Flap_Flag>0</Flap_Flag>"}]
["Flap_Shear_Flag",0,null,{"$f":"\"<\" & A2584 & \">\" & TEXT(B2584,0) & \"</\" & A2584 & \">\"","v":"<Flap_Shear_Flag>0</Flap_Shear_Flag>"}]
["Flap_Chord",0.25,null,{"$f":"\"<\" & A2585 & \">\" & TEXT(B2585,\"0.000000\") & \"</\" & A2585 & \">\"","v":"<Flap_Chord>0.250000</Flap_Chord>"}]
["Flap_Angle",10,null,{"$f":"\"<\" & A2586 & \">\" & TEXT(B2586,\"0.000000\") & \"</\" & A2586 & \">\"","v":"<Flap_Angle>10.000000</Flap_Angle>"}]
["/Airfoil",null,null,{"$f":"\"<\" & A2587 & \">\"","v":"</Airfoil>"}]
["/Sect_Parms",null,null,{"$f":"\"<\" & A2588 & \">\"","v":"</Sect_Parms>"}]
["/Prop_Parms",null,null,{"$f":"\"<\" & A2589 & \">\"","v":"</Prop_Parms>"}]
["/Component",null,{"$f":"C2423","v":"Yes"},{"$f":"IF(C2590=\"Yes\",(\"<\"&A2590&\">\"),(\"<\"&A2590&\"-->\"))","v":"</Component>"}]
["Component","Pylon",{"$f":"IF(Input!D27>3,IF(Input!$D$26=\"Jet\",\"Yes\",\"No\"),IF(Input!$D$27<3,\"Yes\",\"No\"))","v":"Yes"},{"$f":"IF(C2591=\"Yes\",(\"<\"&A2591&\">\"),(\"<!--\"&A2591&\">\"))","v":"<Component>"}]
["Type","Mswing",null,{"$f":"\"<\" & A2592 & \">\" & TEXT(B2592,\"0.000000\") & \"</\" & A2592 & \">\"","v":"<Type>Mswing</Type>"}]
["General_Parms",null,null,{"$f":"\"<\" & A2593 & \">\"","v":"<General_Parms>"}]
["Name",{"$f":"B2061","v":"pylon"},null,{"$f":"\"<\" & A2594 & \">\" & TEXT(B2594,\"0.000000\") & \"</\" & A2594 & \">\"","v":"<Name>pylon</Name>"}]
["ColorR",0,null,{"$f":"\"<\" & A2595 & \">\" & TEXT(B2595,\"0.000000\") & \"</\" & A2595 & \">\"","v":"<ColorR>0.000000</ColorR>"}]
["ColorG",255,null,{"$f":"\"<\" & A2596 & \">\" & TEXT(B2596,\"0.000000\") & \"</\" & A2596 & \">\"","v":"<ColorG>255.000000</ColorG>"}]
["ColorB",0,null,{"$f":"\"<\" & A2597 & \">\" & TEXT(B2597,\"0.000000\") & \"</\" & A2597 & \">\"","v":"<ColorB>0.000000</ColorB>"}]
["Symmetry",0,null,{"$f":"\"<\" & A2598 & \">\" & TEXT(B2598,0) & \"</\" & A2598 & \">\"","v":"<Symmetry>0</Symmetry>"}]
["RelXFormFlag",0,null,"<RelXFormFlag>0</RelXFormFlag>"]
["MaterialID",2,null,"<MaterialID>2</MaterialID>"]
["OutputFlag",1,null,"<OutputFlag>1</OutputFlag>"]
["OutputNameID",0,null,"<OutputNameID>0</OutputNameID>"]
["DisplayChildrenFlag",1,null,"<DisplayChildrenFlag>1</DisplayChildrenFlag>"]
["NumPnts",21,null,"<NumPnts>21</NumPnts>"]
["NumXsecs",11,null,"<NumXsecs>11</NumXsecs>"]
["MassPrior",0,null,"<MassPrior>0</MassPrior>"]
["ShellFlag",0,null,"<ShellFlag>0</ShellFlag>"]
["Tran_X",0,null,{"$f":"\"<\" & A2608 & \">\" & TEXT(B2608,\"0.000000\") & \"</\" & A2608 & \">\"","v":"<Tran_X>0.000000</Tran_X>"}]
["Tran_Y",0,null,"<Tran_Y>0.000000</Tran_Y>"]
["Tran_Z",1.69,null,"<Tran_Z>1.690000</Tran_Z>"]
["TranRel_X",0,null,"<TranRel_X>0.000000</TranRel_X>"]
["TranRel_Y",0,null,"<TranRel_Y>0.000000</TranRel_Y>"]
["TranRel_Z",0,null,"<TranRel_Z>0.000000</TranRel_Z>"]
["Rot_X",90,null,"<Rot_X>90.000000</Rot_X>"]
["Rot_Y",0,null,"<Rot_Y>0.000000</Rot_Y>"]
["Rot_Z",0,null,"<Rot_Z>0.000000</Rot_Z>"]
["RotRel_X",0,null,"<RotRel_X>0.000000</RotRel_X>"]
["RotRel_Y",0,null,"<RotRel_Y>0.000000</RotRel_Y>"]
["RotRel_Z",0,null,"<RotRel_Z>0.000000</RotRel_Z>"]
["Origin",0,null,"<Origin>0.000000</Origin>"]
["Density",1,null,"<Density>1.000000</Density>"]
["ShellMassArea",1,null,"<ShellMassArea>1.000000</ShellMassArea>"]
["RefFlag",0,null,{"$f":"\"<\" & A2623 & \">\" & TEXT(B2623,0) & \"</\" & A2623 & \">\"","v":"<RefFlag>0</RefFlag>"}]
["RefArea",100,null,{"$f":"\"<\" & A2624 & \">\" & TEXT(B2624,\"0.000000\") & \"</\" & A2624 & \">\"","v":"<RefArea>100.000000</RefArea>"}]
["RefSpan",10,null,{"$f":"\"<\" & A2625 & \">\" & TEXT(B2625,\"0.000000\") & \"</\" & A2625 & \">\"","v":"<RefSpan>10.000000</RefSpan>"}]
["RefCbar",1,null,{"$f":"\"<\" & A2626 & \">\" & TEXT(B2626,\"0.000000\") & \"</\" & A2626 & \">\"","v":"<RefCbar>1.000000</RefCbar>"}]
["AutoRefAreaFlag",1,null,{"$f":"\"<\" & A2627 & \">\" & TEXT(B2627,0) & \"</\" & A2627 & \">\"","v":"<AutoRefAreaFlag>1</AutoRefAreaFlag>"}]
["AutoRefSpanFlag",1,null,{"$f":"\"<\" & A2628 & \">\" & TEXT(B2628,0) & \"</\" & A2628 & \">\"","v":"<AutoRefSpanFlag>1</AutoRefSpanFlag>"}]
["AutoRefCbarFlag",1,null,{"$f":"\"<\" & A2629 & \">\" & TEXT(B2629,0) & \"</\" & A2629 & \">\"","v":"<AutoRefCbarFlag>1</AutoRefCbarFlag>"}]
["AeroCenter_X",0,null,{"$f":"\"<\" & A2630 & \">\" & TEXT(B2630,\"0.000000\") & \"</\" & A2630 & \">\"","v":"<AeroCenter_X>0.000000</AeroCenter_X>"}]
["AeroCenter_Y",0,null,{"$f":"\"<\" & A2631 & \">\" & TEXT(B2631,\"0.000000\") & \"</\" & A2631 & \">\"","v":"<AeroCenter_Y>0.000000</AeroCenter_Y>"}]
["AeroCenter_Z",0,null,{"$f":"\"<\" & A2632 & \">\" & TEXT(B2632,\"0.000000\") & \"</\" & A2632 & \">\"","v":"<AeroCenter_Z>0.000000</AeroCenter_Z>"}]
["AutoAeroCenterFlag",1,null,{"$f":"\"<\" & A2633 & \">\" & TEXT(B2633,0) & \"</\" & A2633 & \">\"","v":"<AutoAeroCenterFlag>1</AutoAeroCenterFlag>"}]
["WakeActiveFlag",0,null,{"$f":"\"<\" & A2634 & \">\" & TEXT(B2634,0) & \"</\" & A2634 & \">\"","v":"<WakeActiveFlag>0</WakeActiveFlag>"}]
["PosAttachFlag",3,null,{"$f":"\"<\" & A2635 & \">\" & TEXT(B2635,0) & \"</\" & A2635 & \">\"","v":"<PosAttachFlag>3</PosAttachFlag>"}]
["U_Attach",0,null,{"$f":"\"<\" & A2636 & \">\" & TEXT(B2636,\"0.000000\") & \"</\" & A2636 & \">\"","v":"<U_Attach>0.000000</U_Attach>"}]
["V_Attach",0,null,{"$f":"\"<\" & A2637 & \">\" & TEXT(B2637,\"0.000000\") & \"</\" & A2637 & \">\"","v":"<V_Attach>0.000000</V_Attach>"}]
["PtrID",148458298,null,{"$f":"\"<\" & A2638 & \">\" & TEXT(B2638,0) & \"</\" & A2638 & \">\"","v":"<PtrID>148458298</PtrID>"}]
["Parent_PtrID",149096552,null,{"$f":"\"<\" & A2639 & \">\" & TEXT(B2639,0) & \"</\" & A2639 & \">\"","v":"<Parent_PtrID>149096552</Parent_PtrID>"}]
["/General_Parms",null,null,{"$f":"\"<\" & A2640 & \">\"","v":"</General_Parms>"}]
["Mswing_Parms",null,null,{"$f":"\"<\" & A2641 & \">\"","v":"<Mswing_Parms>"}]
["Total_Area",{"$f":"B2702","v":{"$error":"#VALUE!"}},null,{"$f":"\"<\" & A2642 & \">\" & TEXT(B2642,\"0.000000\") & \"</\" & A2642 & \">\"","v":{"$error":"#VALUE!"}}]
["Total_Span",{"$f":"B2703","v":0.9},null,{"$f":"\"<\" & A2643 & \">\" & TEXT(B2643,\"0.000000\") & \"</\" & A2643 & \">\"","v":"<Total_Span>0.900000</Total_Span>"}]
["Total_Proj_Span",{"$f":"B2703*COS(B2710*PI()/180)","v":0.9},null,{"$f":"\"<\" & A2644 & \">\" & TEXT(B2644,\"0.000000\") & \"</\" & A2644 & \">\"","v":"<Total_Proj_Span>0.900000</Total_Proj_Span>"}]
["Avg_Chord",{"$f":"B2642/B2643","v":{"$error":"#VALUE!"}},null,{"$f":"\"<\" & A2645 & \">\" & TEXT(B2645,\"0.000000\") & \"</\" & A2645 & \">\"","v":{"$error":"#VALUE!"}}]
["Sweep_Off",{"$f":"B2113","v":0},null,{"$f":"\"<\" & A2646 & \">\" & TEXT(B2646,\"0.000000\") & \"</\" & A2646 & \">\"","v":"<Sweep_Off>0.000000</Sweep_Off>"}]
["Deg_Per_Seg",9,null,{"$f":"\"<\" & A2647 & \">\" & TEXT(B2647,0) & \"</\" & A2647 & \">\"","v":"<Deg_Per_Seg>9</Deg_Per_Seg>"}]
["Max_Num_Seg",9,null,{"$f":"\"<\" & A2648 & \">\" & TEXT(B2648,0) & \"</\" & A2648 & \">\"","v":"<Max_Num_Seg>9</Max_Num_Seg>"}]
["Rel_Dihedral_Flag",0,null,{"$f":"\"<\" & A2649 & \">\" & TEXT(B2649,0) & \"</\" & A2649 & \">\"","v":"<Rel_Dihedral_Flag>0</Rel_Dihedral_Flag>"}]
["Rel_Twist_Flag",0,null,{"$f":"\"<\" & A2650 & \">\" & TEXT(B2650,0) & \"</\" & A2650 & \">\"","v":"<Rel_Twist_Flag>0</Rel_Twist_Flag>"}]
["Round_End_Cap_Flag",0,null,{"$f":"\"<\" & A2651 & \">\" & TEXT(B2651,0) & \"</\" & A2651 & \">\"","v":"<Round_End_Cap_Flag>0</Round_End_Cap_Flag>"}]
["/Mswing_Parms",null,null,{"$f":"\"<\" & A2652 & \">\"","v":"</Mswing_Parms>"}]
["Airfoil_List",null,null,{"$f":"\"<\" & A2653 & \">\"","v":"<Airfoil_List>"}]
["Airfoil","Airfoil0",null,{"$f":"\"<\" & A2654 & \">\"","v":"<Airfoil>"}]
["Type",{"$f":"B2122","v":1},null,{"$f":"\"<\" & A2655 & \">\" & TEXT(B2655,0) & \"</\" & A2655 & \">\"","v":"<Type>1</Type>"}]
["Inverted_Flag",0,null,{"$f":"\"<\" & A2656 & \">\" & TEXT(B2656,0) & \"</\" & A2656 & \">\"","v":"<Inverted_Flag>0</Inverted_Flag>"}]
["Camber",0,null,{"$f":"\"<\" & A2657 & \">\" & TEXT(B2657,\"0.000000\") & \"</\" & A2657 & \">\"","v":"<Camber>0.000000</Camber>"}]
["Camber_Loc",0.5,null,"<Camber_Loc>0.500000</Camber_Loc>"]
["Thickness",0.08,null,"<Thickness>0.080000</Thickness>"]
["Thickness_Loc",0.3,null,"<Thickness_Loc>0.300000</Thickness_Loc>"]
["Radius_Le",7.0520000000000001E-3,null,"<Radius_Le>0.007052</Radius_Le>"]
["Radius_Te",0,null,"<Radius_Te>0.000000</Radius_Te>"]
["Six_Series",63,null,{"$f":"\"<\" & A2663 & \">\" & TEXT(B2663,0) & \"</\" & A2663 & \">\"","v":"<Six_Series>63</Six_Series>"}]
["Ideal_Cl",0,null,{"$f":"\"<\" & A2664 & \">\" & TEXT(B2664,\"0.000000\") & \"</\" & A2664 & \">\"","v":"<Ideal_Cl>0.000000</Ideal_Cl>"}]
["A",0,null,{"$f":"\"<\" & A2665 & \">\" & TEXT(B2665,\"0.000000\") & \"</\" & A2665 & \">\"","v":"<A>0.000000</A>"}]
["Slat_Flag",0,null,{"$f":"\"<\" & A2666 & \">\" & TEXT(B2666,0) & \"</\" & A2666 & \">\"","v":"<Slat_Flag>0</Slat_Flag>"}]
["Slat_Shear_Flag",0,null,{"$f":"\"<\" & A2667 & \">\" & TEXT(B2667,0) & \"</\" & A2667 & \">\"","v":"<Slat_Shear_Flag>0</Slat_Shear_Flag>"}]
["Slat_Chord",0.25,null,{"$f":"\"<\" & A2668 & \">\" & TEXT(B2668,\"0.000000\") & \"</\" & A2668 & \">\"","v":"<Slat_Chord>0.250000</Slat_Chord>"}]
["Slat_Angle",10,null,{"$f":"\"<\" & A2669 & \">\" & TEXT(B2669,\"0.000000\") & \"</\" & A2669 & \">\"","v":"<Slat_Angle>10.000000</Slat_Angle>"}]
["Flap_Flag",0,null,{"$f":"\"<\" & A2670 & \">\" & TEXT(B2670,0) & \"</\" & A2670 & \">\"","v":"<Flap_Flag>0</Flap_Flag>"}]
["Flap_Shear_Flag",0,null,{"$f":"\"<\" & A2671 & \">\" & TEXT(B2671,0) & \"</\" & A2671 & \">\"","v":"<Flap_Shear_Flag>0</Flap_Shear_Flag>"}]
["Flap_Chord",0.25,null,{"$f":"\"<\" & A2672 & \">\" & TEXT(B2672,\"0.000000\") & \"</\" & A2672 & \">\"","v":"<Flap_Chord>0.250000</Flap_Chord>"}]
["Flap_Angle",10,null,{"$f":"\"<\" & A2673 & \">\" & TEXT(B2673,\"0.000000\") & \"</\" & A2673 & \">\"","v":"<Flap_Angle>10.000000</Flap_Angle>"}]
["/Airfoil",null,null,{"$f":"\"<\" & A2674 & \">\"","v":"</Airfoil>"}]
["Airfoil","Airfoil1",null,{"$f":"\"<\" & A2675 & \">\"","v":"<Airfoil>"}]
["Type",{"$f":"B2143","v":1},null,{"$f":"\"<\" & A2676 & \">\" & TEXT(B2676,0) & \"</\" & A2676 & \">\"","v":"<Type>1</Type>"}]
["Inverted_Flag",0,null,{"$f":"\"<\" & A2677 & \">\" & TEXT(B2677,0) & \"</\" & A2677 & \">\"","v":"<Inverted_Flag>0</Inverted_Flag>"}]
["Camber",0,null,{"$f":"\"<\" & A2678 & \">\" & TEXT(B2678,\"0.000000\") & \"</\" & A2678 & \">\"","v":"<Camber>0.000000</Camber>"}]
["Camber_Loc",0.5,null,"<Camber_Loc>0.500000</Camber_Loc>"]
["Thickness",0.08,null,"<Thickness>0.080000</Thickness>"]
["Thickness_Loc",0.3,null,"<Thickness_Loc>0.300000</Thickness_Loc>"]
["Radius_Le",7.0520000000000001E-3,null,"<Radius_Le>0.007052</Radius_Le>"]
["Radius_Te",0,null,"<Radius_Te>0.000000</Radius_Te>"]
["Six_Series",63,null,{"$f":"\"<\" & A2684 & \">\" & TEXT(B2684,0) & \"</\" & A2684 & \">\"","v":"<Six_Series>63</Six_Series>"}]
["Ideal_Cl",0,null,{"$f":"\"<\" & A2685 & \">\" & TEXT(B2685,\"0.000000\") & \"</\" & A2685 & \">\"","v":"<Ideal_Cl>0.000000</Ideal_Cl>"}]
["A",0,null,{"$f":"\"<\" & A2686 & \">\" & TEXT(B2686,\"0.000000\") & \"</\" & A2686 & \">\"","v":"<A>0.000000</A>"}]
["Slat_Flag",0,null,{"$f":"\"<\" & A2687 & \">\" & TEXT(B2687,0) & \"</\" & A2687 & \">\"","v":"<Slat_Flag>0</Slat_Flag>"}]
["Slat_Shear_Flag",0,null,{"$f":"\"<\" & A2688 & \">\" & TEXT(B2688,0) & \"</\" & A2688 & \">\"","v":"<Slat_Shear_Flag>0</Slat_Shear_Flag>"}]
["Slat_Chord",0.25,null,{"$f":"\"<\" & A2689 & \">\" & TEXT(B2689,\"0.000000\") & \"</\" & A2689 & \">\"","v":"<Slat_Chord>0.250000</Slat_Chord>"}]
["Slat_Angle",10,null,{"$f":"\"<\" & A2690 & \">\" & TEXT(B2690,\"0.000000\") & \"</\" & A2690 & \">\"","v":"<Slat_Angle>10.000000</Slat_Angle>"}]
["Flap_Flag",0,null,{"$f":"\"<\" & A2691 & \">\" & TEXT(B2691,0) & \"</\" & A2691 & \">\"","v":"<Flap_Flag>0</Flap_Flag>"}]
["Flap_Shear_Flag",0,null,{"$f":"\"<\" & A2692 & \">\" & TEXT(B2692,0) & \"</\" & A2692 & \">\"","v":"<Flap_Shear_Flag>0</Flap_Shear_Flag>"}]
["Flap_Chord",0.25,null,{"$f":"\"<\" & A2693 & \">\" & TEXT(B2693,\"0.000000\") & \"</\" & A2693 & \">\"","v":"<Flap_Chord>0.250000</Flap_Chord>"}]
["Flap_Angle",10,null,{"$f":"\"<\" & A2694 & \">\" & TEXT(B2694,\"0.000000\") & \"</\" & A2694 & \">\"","v":"<Flap_Angle>10.000000</Flap_Angle>"}]
["/Airfoil",null,null,{"$f":"\"<\" & A2695 & \">\"","v":"</Airfoil>"}]
["/Airfoil_List",null,null,{"$f":"\"<\" & A2696 & \">\"","v":"</Airfoil_List>"}]
["Section_List",null,null,{"$f":"\"<\" & A2697 & \">\"","v":"<Section_List>"}]
["Section","Section0",null,{"$f":"\"<\" & A2698 & \">\"","v":"<Section>"}]
["Driver",{"$f":"B2166","v":4},null,{"$f":"\"<\" & A2699 & \">\" & TEXT(B2699,0) & \"</\" & A2699 & \">\"","v":"<Driver>4</Driver>"}]
["AR",{"$f":"(B2703^2)/B2702","v":{"$error":"#VALUE!"}},null,{"$f":"\"<\" & A2700 & \">\" & TEXT(B2700,\"0.000000\") & \"</\" & A2700 & \">\"","v":{"$error":"#VALUE!"}}]
["TR",{"$f":"B2704/B2705","v":{"$error":"#VALUE!"}},null,{"$error":"#VALUE!"}]
["Area",{"$f":"0.5*(B2704+B2705)*B2703","v":{"$error":"#VALUE!"}},null,{"$error":"#VALUE!"}]
["Span",{"$f":"B2170","v":0.9},null,"<Span>0.900000</Span>"]
["TC",{"$f":"0.8*IF(B2294 < b_W.i, c_r.W + B2294*(TAN(phi_100.W.i*PI()/180) - TAN(phi_0.W.i*PI()/180)), c_t.W + ((b_W/2) -B2294)*(TAN(phi_0.W.o*PI()/180) - TAN(phi_100.W.o*PI()/180)))","v":{"$error":"#VALUE!"}},null,{"$error":"#VALUE!"}]
["RC",{"$f":"B2704","v":{"$error":"#VALUE!"}},null,{"$error":"#VALUE!"}]
["Sweep",50,null,"<Sweep>50.000000</Sweep>"]
["SweepLoc",0,null,"<SweepLoc>0.000000</SweepLoc>"]
["Twist",0,null,"<Twist>0.000000</Twist>"]
["TwistLoc",0,null,"<TwistLoc>0.000000</TwistLoc>"]
["Dihedral",0,null,"<Dihedral>0.000000</Dihedral>"]
["Dihed_Crv1",0,null,"<Dihed_Crv1>0.000000</Dihed_Crv1>"]
["Dihed_Crv2",0,null,"<Dihed_Crv2>0.000000</Dihed_Crv2>"]
["Dihed_Crv1_Str",0.75,null,"<Dihed_Crv1_Str>0.750000</Dihed_Crv1_Str>"]
["Dihed_Crv2_Str",0.75,null,"<Dihed_Crv2_Str>0.750000</Dihed_Crv2_Str>"]
["DihedRotFlag",0,null,{"$f":"\"<\" & A2715 & \">\" & TEXT(B2715,0) & \"</\" & A2715 & \">\"","v":"<DihedRotFlag>0</DihedRotFlag>"}]
["SmoothBlendFlag",0,null,{"$f":"\"<\" & A2716 & \">\" & TEXT(B2716,0) & \"</\" & A2716 & \">\"","v":"<SmoothBlendFlag>0</SmoothBlendFlag>"}]
["NumInterpXsecs",1,null,{"$f":"\"<\" & A2717 & \">\" & TEXT(B2717,0) & \"</\" & A2717 & \">\"","v":"<NumInterpXsecs>1</NumInterpXsecs>"}]
["/Section",null,null,{"$f":"\"<\" & A2718 & \">\"","v":"</Section>"}]
["/Section_List",null,null,{"$f":"\"<\" & A2719 & \">\"","v":"</Section_List>"}]
["/Component",null,{"$f":"C2591","v":"Yes"},{"$f":"IF(C2720=\"Yes\",(\"<\"&A2720&\">\"),(\"<\"&A2720&\"-->\"))","v":"</Component>"}]
["Component","FanSect",{"$f":"IF(AND(C2276=\"Yes\",C2423=\"Yes\"),\"No\",\"Yes\")","v":"Yes"},{"$f":"IF(C2721=\"Yes\",(\"<\"&A2721&\">\"),(\"<!--\"&A2721&\">\"))","v":"<Component>"}]
["Type","Engine",null,{"$f":"\"<\" & A2722 & \">\" & TEXT(B2722,\"0.000000\") & \"</\" & A2722 & \">\"","v":"<Type>Engine</Type>"}]
["General_Parms",null,null,{"$f":"\"<\" & A2723 & \">\"","v":"<General_Parms>"}]
["Name",{"$f":"B2191","v":"fan_section"},null,{"$f":"\"<\" & A2724 & \">\" & TEXT(B2724,\"0.000000\") & \"</\" & A2724 & \">\"","v":"<Name>fan_section</Name>"}]
["ColorR",0,null,{"$f":"\"<\" & A2725 & \">\" & TEXT(B2725,\"0.000000\") & \"</\" & A2725 & \">\"","v":"<ColorR>0.000000</ColorR>"}]
["ColorG",0,null,{"$f":"\"<\" & A2726 & \">\" & TEXT(B2726,\"0.000000\") & \"</\" & A2726 & \">\"","v":"<ColorG>0.000000</ColorG>"}]
["ColorB",255,null,{"$f":"\"<\" & A2727 & \">\" & TEXT(B2727,\"0.000000\") & \"</\" & A2727 & \">\"","v":"<ColorB>255.000000</ColorB>"}]
["Symmetry",0,null,{"$f":"\"<\" & A2728 & \">\" & TEXT(B2728,0) & \"</\" & A2728 & \">\"","v":"<Symmetry>0</Symmetry>"}]
["RelXFormFlag",0,null,"<RelXFormFlag>0</RelXFormFlag>"]
["MaterialID",2,null,"<MaterialID>2</MaterialID>"]
["OutputFlag",1,null,"<OutputFlag>1</OutputFlag>"]
["OutputNameID",0,null,"<OutputNameID>0</OutputNameID>"]
["DisplayChildrenFlag",1,null,"<DisplayChildrenFlag>1</DisplayChildrenFlag>"]
["NumPnts",21,null,"<NumPnts>21</NumPnts>"]
["NumXsecs",11,null,"<NumXsecs>11</NumXsecs>"]
["MassPrior",0,null,"<MassPrior>0</MassPrior>"]
["ShellFlag",0,null,"<ShellFlag>0</ShellFlag>"]
["Tran_X",0,null,{"$f":"\"<\" & A2738 & \">\" & TEXT(B2738,\"0.000000\") & \"</\" & A2738 & \">\"","v":"<Tran_X>0.000000</Tran_X>"}]
["Tran_Y",0,null,"<Tran_Y>0.000000</Tran_Y>"]
["Tran_Z",0,null,"<Tran_Z>0.000000</Tran_Z>"]
["TranRel_X",0,null,"<TranRel_X>0.000000</TranRel_X>"]
["TranRel_Y",0,null,"<TranRel_Y>0.000000</TranRel_Y>"]
["TranRel_Z",0,null,"<TranRel_Z>0.000000</TranRel_Z>"]
["Rot_X",0,null,"<Rot_X>0.000000</Rot_X>"]
["Rot_Y",0,null,"<Rot_Y>0.000000</Rot_Y>"]
["Rot_Z",0,null,"<Rot_Z>0.000000</Rot_Z>"]
["RotRel_X",0,null,"<RotRel_X>0.000000</RotRel_X>"]
["RotRel_Y",0,null,"<RotRel_Y>0.000000</RotRel_Y>"]
["RotRel_Z",0,null,"<RotRel_Z>0.000000</RotRel_Z>"]
["Origin",0,null,"<Origin>0.000000</Origin>"]
["Density",1,null,"<Density>1.000000</Density>"]
["ShellMassArea",1,null,"<ShellMassArea>1.000000</ShellMassArea>"]
["RefFlag",0,null,{"$f":"\"<\" & A2753 & \">\" & TEXT(B2753,0) & \"</\" & A2753 & \">\"","v":"<RefFlag>0</RefFlag>"}]
["RefArea",100,null,{"$f":"\"<\" & A2754 & \">\" & TEXT(B2754,\"0.000000\") & \"</\" & A2754 & \">\"","v":"<RefArea>100.000000</RefArea>"}]
["RefSpan",10,null,{"$f":"\"<\" & A2755 & \">\" & TEXT(B2755,\"0.000000\") & \"</\" & A2755 & \">\"","v":"<RefSpan>10.000000</RefSpan>"}]
["RefCbar",1,null,{"$f":"\"<\" & A2756 & \">\" & TEXT(B2756,\"0.000000\") & \"</\" & A2756 & \">\"","v":"<RefCbar>1.000000</RefCbar>"}]
["AutoRefAreaFlag",1,null,{"$f":"\"<\" & A2757 & \">\" & TEXT(B2757,0) & \"</\" & A2757 & \">\"","v":"<AutoRefAreaFlag>1</AutoRefAreaFlag>"}]
["AutoRefSpanFlag",1,null,{"$f":"\"<\" & A2758 & \">\" & TEXT(B2758,0) & \"</\" & A2758 & \">\"","v":"<AutoRefSpanFlag>1</AutoRefSpanFlag>"}]
["AutoRefCbarFlag",1,null,{"$f":"\"<\" & A2759 & \">\" & TEXT(B2759,0) & \"</\" & A2759 & \">\"","v":"<AutoRefCbarFlag>1</AutoRefCbarFlag>"}]
["AeroCenter_X",0,null,{"$f":"\"<\" & A2760 & \">\" & TEXT(B2760,\"0.000000\") & \"</\" & A2760 & \">\"","v":"<AeroCenter_X>0.000000</AeroCenter_X>"}]
["AeroCenter_Y",0,null,{"$f":"\"<\" & A2761 & \">\" & TEXT(B2761,\"0.000000\") & \"</\" & A2761 & \">\"","v":"<AeroCenter_Y>0.000000</AeroCenter_Y>"}]
["AeroCenter_Z",0,null,{"$f":"\"<\" & A2762 & \">\" & TEXT(B2762,\"0.000000\") & \"</\" & A2762 & \">\"","v":"<AeroCenter_Z>0.000000</AeroCenter_Z>"}]
["AutoAeroCenterFlag",1,null,{"$f":"\"<\" & A2763 & \">\" & TEXT(B2763,0) & \"</\" & A2763 & \">\"","v":"<AutoAeroCenterFlag>1</AutoAeroCenterFlag>"}]
["WakeActiveFlag",0,null,{"$f":"\"<\" & A2764 & \">\" & TEXT(B2764,0) & \"</\" & A2764 & \">\"","v":"<WakeActiveFlag>0</WakeActiveFlag>"}]
["PosAttachFlag",3,null,{"$f":"\"<\" & A2765 & \">\" & TEXT(B2765,0) & \"</\" & A2765 & \">\"","v":"<PosAttachFlag>3</PosAttachFlag>"}]
["U_Attach",0,null,{"$f":"\"<\" & A2766 & \">\" & TEXT(B2766,\"0.000000\") & \"</\" & A2766 & \">\"","v":"<U_Attach>0.000000</U_Attach>"}]
["V_Attach",0,null,{"$f":"\"<\" & A2767 & \">\" & TEXT(B2767,\"0.000000\") & \"</\" & A2767 & \">\"","v":"<V_Attach>0.000000</V_Attach>"}]
["PtrID",149328112,null,{"$f":"\"<\" & A2768 & \">\" & TEXT(B2768,0) & \"</\" & A2768 & \">\"","v":"<PtrID>149328112</PtrID>"}]
["Parent_PtrID",149096552,null,{"$f":"\"<\" & A2769 & \">\" & TEXT(B2769,0) & \"</\" & A2769 & \">\"","v":"<Parent_PtrID>149096552</Parent_PtrID>"}]
["/General_Parms",null,null,{"$f":"\"<\" & A2770 & \">\"","v":"</General_Parms>"}]
["Engine_Parms",null,null,{"$f":"\"<\" & A2771 & \">\"","v":"<Engine_Parms>"}]
["Engine_Type",{"$f":"B2239","v":0},null,{"$f":"\"<\" & A2772 & \">\" & TEXT(B2772,0) & \"</\" & A2772 & \">\"","v":"<Engine_Type>0</Engine_Type>"}]
["Radius_Tip",1.69,null,{"$f":"\"<\" & A2773 & \">\" & TEXT(B2773,\"0.000000\") & \"</\" & A2773 & \">\"","v":"<Radius_Tip>1.690000</Radius_Tip>"}]
["Max_Tip",1.1499999999999999,null,{"$f":"\"<\" & A2774 & \">\" & TEXT(B2774,\"0.000000\") & \"</\" & A2774 & \">\"","v":"<Max_Tip>1.150000</Max_Tip>"}]
["Hub_Tip",0.31333299999999997,null,{"$f":"\"<\" & A2775 & \">\" & TEXT(B2775,\"0.000000\") & \"</\" & A2775 & \">\"","v":"<Hub_Tip>0.313333</Hub_Tip>"}]
["Eng_Length",0,null,{"$f":"\"<\" & A2776 & \">\" & TEXT(B2776,\"0.000000\") & \"</\" & A2776 & \">\"","v":"<Eng_Length>0.000000</Eng_Length>"}]
["Inlet_Type",1,null,{"$f":"\"<\" & A2777 & \">\" & TEXT(B2777,0) & \"</\" & A2777 & \">\"","v":"<Inlet_Type>1</Inlet_Type>"}]
["Inl_Noz_Color",0,null,{"$f":"\"<\" & A2778 & \">\" & TEXT(B2778,0) & \"</\" & A2778 & \">\"","v":"<Inl_Noz_Color>0</Inl_Noz_Color>"}]
["Inlet_XY_Sym_Flag",0,null,{"$f":"\"<\" & A2779 & \">\" & TEXT(B2779,0) & \"</\" & A2779 & \">\"","v":"<Inlet_XY_Sym_Flag>0</Inlet_XY_Sym_Flag>"}]
["Inlet_Half_Split_Flag",0,null,{"$f":"\"<\" & A2780 & \">\" & TEXT(B2780,0) & \"</\" & A2780 & \">\"","v":"<Inlet_Half_Split_Flag>0</Inlet_Half_Split_Flag>"}]
["Cowl_Length",{"$f":"B2248","v":1.3726875000000003},null,{"$f":"\"<\" & A2781 & \">\" & TEXT(B2781,\"0.000000\") & \"</\" & A2781 & \">\"","v":"<Cowl_Length>1.372688</Cowl_Length>"}]
["Eng_Thrt_Ratio",1.1499999999999999,null,"<Eng_Thrt_Ratio>1.150000</Eng_Thrt_Ratio>"]
["Hilight_Thrt_Ratio",1.1499999999999999,null,"<Hilight_Thrt_Ratio>1.150000</Hilight_Thrt_Ratio>"]
["Lip_Finess_Ratio",1.026904,null,"<Lip_Finess_Ratio>1.026904</Lip_Finess_Ratio>"]
["Height_Width_Ratio",1,null,"<Height_Width_Ratio>1.000000</Height_Width_Ratio>"]
["Upper_Surf_Shape_Factor",-0.95229299999999995,null,"<Upper_Surf_Shape_Factor>-0.952293</Upper_Surf_Shape_Factor>"]
["Lower_Surf_Shape_Factor",0.66507400000000005,null,"<Lower_Surf_Shape_Factor>0.665074</Lower_Surf_Shape_Factor>"]
["Inlet_X_Axis_Rot",90,null,"<Inlet_X_Axis_Rot>90.000000</Inlet_X_Axis_Rot>"]
["Inlet_Scarf_Angle",2,null,"<Inlet_Scarf_Angle>2.000000</Inlet_Scarf_Angle>"]
["Inlet_Duct_On_Off",0,null,{"$f":"\"<\" & A2790 & \">\" & TEXT(B2790,0) & \"</\" & A2790 & \">\"","v":"<Inlet_Duct_On_Off>0</Inlet_Duct_On_Off>"}]
["Inlet_Duct_X_Offset",3,null,{"$f":"\"<\" & A2791 & \">\" & TEXT(B2791,\"0.000000\") & \"</\" & A2791 & \">\"","v":"<Inlet_Duct_X_Offset>3.000000</Inlet_Duct_X_Offset>"}]
["Inlet_Duct_Y_Offset",1,null,{"$f":"\"<\" & A2792 & \">\" & TEXT(B2792,\"0.000000\") & \"</\" & A2792 & \">\"","v":"<Inlet_Duct_Y_Offset>1.000000</Inlet_Duct_Y_Offset>"}]
["Inlet_Duct_Shape_Factor",0.5,null,{"$f":"\"<\" & A2793 & \">\" & TEXT(B2793,\"0.000000\") & \"</\" & A2793 & \">\"","v":"<Inlet_Duct_Shape_Factor>0.500000</Inlet_Duct_Shape_Factor>"}]
["Divertor_On_Off",0,null,{"$f":"\"<\" & A2794 & \">\" & TEXT(B2794,0) & \"</\" & A2794 & \">\"","v":"<Divertor_On_Off>0</Divertor_On_Off>"}]
["Divertor_Height",0.5,null,{"$f":"\"<\" & A2795 & \">\" & TEXT(B2795,\"0.000000\") & \"</\" & A2795 & \">\"","v":"<Divertor_Height>0.500000</Divertor_Height>"}]
["Divertor_Length",1,null,{"$f":"\"<\" & A2796 & \">\" & TEXT(B2796,\"0.000000\") & \"</\" & A2796 & \">\"","v":"<Divertor_Length>1.000000</Divertor_Length>"}]
["Nozzle_Type",0,null,{"$f":"\"<\" & A2797 & \">\" & TEXT(B2797,0) & \"</\" & A2797 & \">\"","v":"<Nozzle_Type>0</Nozzle_Type>"}]
["Nozzle_Length",{"$f":"IF(n_e=4,B1732,((B1732*B1707) + c_r.V)/B2773)","v":6.4777601818047428},null,{"$f":"\"<\" & A2798 & \">\" & TEXT(B2798,\"0.000000\") & \"</\" & A2798 & \">\"","v":"<Nozzle_Length>6.477760</Nozzle_Length>"}]
["Exit_Area_Ratio",{"$f":"B2266","v":1.2},null,{"$f":"\"<\" & A2799 & \">\" & TEXT(B2799,\"0.000000\") & \"</\" & A2799 & \">\"","v":"<Exit_Area_Ratio>1.200000</Exit_Area_Ratio>"}]
["Nozzle_Height_Width_Ratio",1,null,{"$f":"\"<\" & A2800 & \">\" & TEXT(B2800,\"0.000000\") & \"</\" & A2800 & \">\"","v":"<Nozzle_Height_Width_Ratio>1.000000</Nozzle_Height_Width_Ratio>"}]
["Exit_Throat_Ratio",1.5,null,{"$f":"\"<\" & A2801 & \">\" & TEXT(B2801,\"0.000000\") & \"</\" & A2801 & \">\"","v":"<Exit_Throat_Ratio>1.500000</Exit_Throat_Ratio>"}]
["Dive_Flap_Ratio",1,null,{"$f":"\"<\" & A2802 & \">\" & TEXT(B2802,\"0.000000\") & \"</\" & A2802 & \">\"","v":"<Dive_Flap_Ratio>1.000000</Dive_Flap_Ratio>"}]
["Nozzle_Duct_On_Off",0,null,{"$f":"\"<\" & A2803 & \">\" & TEXT(B2803,0) & \"</\" & A2803 & \">\"","v":"<Nozzle_Duct_On_Off>0</Nozzle_Duct_On_Off>"}]
["Nozzle_Duct_X_Offset",1,null,{"$f":"\"<\" & A2804 & \">\" & TEXT(B2804,\"0.000000\") & \"</\" & A2804 & \">\"","v":"<Nozzle_Duct_X_Offset>1.000000</Nozzle_Duct_X_Offset>"}]
["Nozzle_Duct_Y_Offset",0,null,{"$f":"\"<\" & A2805 & \">\" & TEXT(B2805,\"0.000000\") & \"</\" & A2805 & \">\"","v":"<Nozzle_Duct_Y_Offset>0.000000</Nozzle_Duct_Y_Offset>"}]
["Nozzle_Duct_Shape_Factor",0,null,{"$f":"\"<\" & A2806 & \">\" & TEXT(B2806,\"0.000000\") & \"</\" & A2806 & \">\"","v":"<Nozzle_Duct_Shape_Factor>0.000000</Nozzle_Duct_Shape_Factor>"}]
["/Engine_Parms",null,null,{"$f":"\"<\" & A2807 & \">\"","v":"</Engine_Parms>"}]
["/Component",null,{"$f":"IF(OR(C2423=\"Yes\",C2276=\"No\"),\"No\",\"Yes\")","v":"No"},{"$f":"IF(C2808=\"Yes\",(\"<\"&A2808&\">\"),(\"<\"&A2808&\"-->\"))","v":"</Component-->"}]
["Component",{"$f":"B2812","v":"Engine 1"},{"$f":"IF(Input!$D$27>=4,\"Yes\",\"No\")","v":"No"},{"$f":"IF(C2809=\"Yes\",(\"<\"&A2809&\">\"),(\"<!--\"&A2809&\">\"))","v":"<!--Component>"}]
["Type","Blank",null,{"$f":"\"<\" & A2810 & \">\" & TEXT(B2810,0) & \"</\" & A2810 & \">\"","v":"<Type>Blank</Type>"}]
["General_Parms",null,null,{"$f":"\"<\" & A2811 & \">\"","v":"<General_Parms>"}]
["Name",{"$f":"\"Engine 1\"","v":"Engine 1"},null,{"$f":"\"<\" & A2812 & \">\" & TEXT(B2812,0) & \"</\" & A2812 & \">\"","v":"<Name>Engine 1</Name>"}]
["ColorR",0,null,{"$f":"\"<\" & A2813 & \">\" & TEXT(B2813,\"0.000000\") & \"</\" & A2813 & \">\"","v":"<ColorR>0.000000</ColorR>"}]
["ColorG",0,null,{"$f":"\"<\" & A2814 & \">\" & TEXT(B2814,\"0.000000\") & \"</\" & A2814 & \">\"","v":"<ColorG>0.000000</ColorG>"}]
["ColorB",255,null,{"$f":"\"<\" & A2815 & \">\" & TEXT(B2815,\"0.000000\") & \"</\" & A2815 & \">\"","v":"<ColorB>255.000000</ColorB>"}]
["Symmetry",0,null,{"$f":"\"<\" & A2816 & \">\" & TEXT(B2816,0) & \"</\" & A2816 & \">\"","v":"<Symmetry>0</Symmetry>"}]
["RelXFormFlag",0,null,"<RelXFormFlag>0</RelXFormFlag>"]
["MaterialID",0,null,"<MaterialID>0</MaterialID>"]
["OutputFlag",1,null,"<OutputFlag>1</OutputFlag>"]
["OutputNameID",0,null,"<OutputNameID>0</OutputNameID>"]
["DisplayChildrenFlag",1,null,"<DisplayChildrenFlag>1</DisplayChildrenFlag>"]
["NumPnts",21,null,"<NumPnts>21</NumPnts>"]
["NumXsecs",11,null,"<NumXsecs>11</NumXsecs>"]
["MassPrior",0,null,"<MassPrior>0</MassPrior>"]
["ShellFlag",0,null,"<ShellFlag>0</ShellFlag>"]
["Tran_X",{"$f":"IF(Type_e=\"Jet\",pos_e.j4.x,pos_e.p4.x)","v":"N/A"},null,{"$f":"\"<\" & A2826 & \">\" & TEXT(B2826,\"0.000000\") & \"</\" & A2826 & \">\"","v":"<Tran_X>N/A</Tran_X>"}]
["Tran_Y",{"$f":"IF(Type_e=\"Jet\",pos_e.j4.y,pos_e.p4.y)","v":"N/A"},null,"<Tran_Y>N/A</Tran_Y>"]
["Tran_Z",{"$f":"IF(Type_e=\"Jet\",pos_e.j4.z,pos_e.p4.z)","v":"N/A"},null,"<Tran_Z>N/A</Tran_Z>"]
["TranRel_X",0,null,"<TranRel_X>0.000000</TranRel_X>"]
["TranRel_Y",0,null,"<TranRel_Y>0.000000</TranRel_Y>"]
["TranRel_Z",0,null,"<TranRel_Z>0.000000</TranRel_Z>"]
["Rot_X",0,null,"<Rot_X>0.000000</Rot_X>"]
["Rot_Y",0,null,"<Rot_Y>0.000000</Rot_Y>"]
["Rot_Z",0,null,"<Rot_Z>0.000000</Rot_Z>"]
["RotRel_X",0,null,"<RotRel_X>0.000000</RotRel_X>"]
["RotRel_Y",0,null,"<RotRel_Y>0.000000</RotRel_Y>"]
["RotRel_Z",0,null,"<RotRel_Z>0.000000</RotRel_Z>"]
["Origin",0,null,"<Origin>0.000000</Origin>"]
["Density",1,null,"<Density>1.000000</Density>"]
["ShellMassArea",1,null,"<ShellMassArea>1.000000</ShellMassArea>"]
["RefFlag",0,null,{"$f":"\"<\" & A2841 & \">\" & TEXT(B2841,0) & \"</\" & A2841 & \">\"","v":"<RefFlag>0</RefFlag>"}]
["RefArea",100,null,{"$f":"\"<\" & A2842 & \">\" & TEXT(B2842,\"0.000000\") & \"</\" & A2842 & \">\"","v":"<RefArea>100.000000</RefArea>"}]
["RefSpan",10,null,{"$f":"\"<\" & A2843 & \">\" & TEXT(B2843,\"0.000000\") & \"</\" & A2843 & \">\"","v":"<RefSpan>10.000000</RefSpan>"}]
["RefCbar",1,null,{"$f":"\"<\" & A2844 & \">\" & TEXT(B2844,\"0.000000\") & \"</\" & A2844 & \">\"","v":"<RefCbar>1.000000</RefCbar>"}]
["AutoRefAreaFlag",1,null,{"$f":"\"<\" & A2845 & \">\" & TEXT(B2845,0) & \"</\" & A2845 & \">\"","v":"<AutoRefAreaFlag>1</AutoRefAreaFlag>"}]
["AutoRefSpanFlag",1,null,{"$f":"\"<\" & A2846 & \">\" & TEXT(B2846,0) & \"</\" & A2846 & \">\"","v":"<AutoRefSpanFlag>1</AutoRefSpanFlag>"}]
["AutoRefCbarFlag",1,null,{"$f":"\"<\" & A2847 & \">\" & TEXT(B2847,0) & \"</\" & A2847 & \">\"","v":"<AutoRefCbarFlag>1</AutoRefCbarFlag>"}]
["AeroCenter_X",0,null,{"$f":"\"<\" & A2848 & \">\" & TEXT(B2848,\"0.000000\") & \"</\" & A2848 & \">\"","v":"<AeroCenter_X>0.000000</AeroCenter_X>"}]
["AeroCenter_Y",0,null,{"$f":"\"<\" & A2849 & \">\" & TEXT(B2849,\"0.000000\") & \"</\" & A2849 & \">\"","v":"<AeroCenter_Y>0.000000</AeroCenter_Y>"}]
["AeroCenter_Z",0,null,{"$f":"\"<\" & A2850 & \">\" & TEXT(B2850,\"0.000000\") & \"</\" & A2850 & \">\"","v":"<AeroCenter_Z>0.000000</AeroCenter_Z>"}]
["AutoAeroCenterFlag",1,null,{"$f":"\"<\" & A2851 & \">\" & TEXT(B2851,0) & \"</\" & A2851 & \">\"","v":"<AutoAeroCenterFlag>1</AutoAeroCenterFlag>"}]
["WakeActiveFlag",0,null,{"$f":"\"<\" & A2852 & \">\" & TEXT(B2852,0) & \"</\" & A2852 & \">\"","v":"<WakeActiveFlag>0</WakeActiveFlag>"}]
["PosAttachFlag",0,null,{"$f":"\"<\" & A2853 & \">\" & TEXT(B2853,0) & \"</\" & A2853 & \">\"","v":"<PosAttachFlag>0</PosAttachFlag>"}]
["U_Attach",0,null,{"$f":"\"<\" & A2854 & \">\" & TEXT(B2854,\"0.000000\") & \"</\" & A2854 & \">\"","v":"<U_Attach>0.000000</U_Attach>"}]
["V_Attach",0,null,{"$f":"\"<\" & A2855 & \">\" & TEXT(B2855,\"0.000000\") & \"</\" & A2855 & \">\"","v":"<V_Attach>0.000000</V_Attach>"}]
["PtrID",149518280,null,{"$f":"\"<\" & A2856 & \">\" & TEXT(B2856,0) & \"</\" & A2856 & \">\"","v":"<PtrID>149518280</PtrID>"}]
["Parent_PtrID",0,null,"<Parent_PtrID>0</Parent_PtrID>"]
["Children_PtrID",149520864,null,"<Children_PtrID>149520864</Children_PtrID>"]
["Children_PtrID",149750024,null,"<Children_PtrID>149750024</Children_PtrID>"]
["Children_PtrID",148458299,null,"<Children_PtrID>148458299</Children_PtrID>"]
["Children_PtrID",60521,null,"<Children_PtrID>60521</Children_PtrID>"]
["/General_Parms",null,null,{"$f":"\"<\" & A2862 & \">\"","v":"</General_Parms>"}]
["Blank_Parms",null,null,{"$f":"\"<\" & A2863 & \">\"","v":"<Blank_Parms>"}]
["PointMassFlag",0,null,{"$f":"\"<\" & A2864 & \">\" & TEXT(B2864,0) & \"</\" & A2864 & \">\"","v":"<PointMassFlag>0</PointMassFlag>"}]
["PointMass",1,null,{"$f":"\"<\" & A2865 & \">\" & TEXT(B2865,\"0.000000\") & \"</\" & A2865 & \">\"","v":"<PointMass>1.000000</PointMass>"}]
["/Blank_Parms",null,null,{"$f":"\"<\" & A2866 & \">\"","v":"</Blank_Parms>"}]
["/Component",null,null,{"$f":"\"<\" & A2867 & \">\"","v":"</Component>"}]
["Component","CoreSect",null,{"$f":"\"<\" & A2868 & \">\"","v":"<Component>"}]
["Type","Engine",null,{"$f":"\"<\" & A2869 & \">\" & TEXT(B2869,\"0.000000\") & \"</\" & A2869 & \">\"","v":"<Type>Engine</Type>"}]
["General_Parms",null,null,{"$f":"\"<\" & A2870 & \">\"","v":"<General_Parms>"}]
["Name",{"$f":"B1272","v":"core_section"},null,{"$f":"\"<\" & A2871 & \">\" & TEXT(B2871,\"0.000000\") & \"</\" & A2871 & \">\"","v":"<Name>core_section</Name>"}]
["ColorR",{"$f":"B1273","v":0},null,{"$f":"\"<\" & A2872 & \">\" & TEXT(B2872,\"0.000000\") & \"</\" & A2872 & \">\"","v":"<ColorR>0.000000</ColorR>"}]
["ColorG",0,null,{"$f":"\"<\" & A2873 & \">\" & TEXT(B2873,\"0.000000\") & \"</\" & A2873 & \">\"","v":"<ColorG>0.000000</ColorG>"}]
["ColorB",0,null,{"$f":"\"<\" & A2874 & \">\" & TEXT(B2874,\"0.000000\") & \"</\" & A2874 & \">\"","v":"<ColorB>0.000000</ColorB>"}]
["Symmetry",0,null,{"$f":"\"<\" & A2875 & \">\" & TEXT(B2875,0) & \"</\" & A2875 & \">\"","v":"<Symmetry>0</Symmetry>"}]
["RelXFormFlag",0,null,"<RelXFormFlag>0</RelXFormFlag>"]
["MaterialID",2,null,"<MaterialID>2</MaterialID>"]
["OutputFlag",1,null,"<OutputFlag>1</OutputFlag>"]
["OutputNameID",0,null,"<OutputNameID>0</OutputNameID>"]
["DisplayChildrenFlag",1,null,"<DisplayChildrenFlag>1</DisplayChildrenFlag>"]
["NumPnts",21,null,"<NumPnts>21</NumPnts>"]
["NumXsecs",11,null,"<NumXsecs>11</NumXsecs>"]
["MassPrior",0,null,"<MassPrior>0</MassPrior>"]
["ShellFlag",0,null,"<ShellFlag>0</ShellFlag>"]
["Tran_X",0,null,{"$f":"\"<\" & A2885 & \">\" & TEXT(B2885,\"0.000000\") & \"</\" & A2885 & \">\"","v":"<Tran_X>0.000000</Tran_X>"}]
["Tran_Y",0,null,"<Tran_Y>0.000000</Tran_Y>"]
["Tran_Z",0,null,"<Tran_Z>0.000000</Tran_Z>"]
["TranRel_X",0,null,"<TranRel_X>0.000000</TranRel_X>"]
["TranRel_Y",0,null,"<TranRel_Y>0.000000</TranRel_Y>"]
["TranRel_Z",0,null,"<TranRel_Z>0.000000</TranRel_Z>"]
["Rot_X",0,null,"<Rot_X>0.000000</Rot_X>"]
["Rot_Y",0,null,"<Rot_Y>0.000000</Rot_Y>"]
["Rot_Z",0,null,"<Rot_Z>0.000000</Rot_Z>"]
["RotRel_X",0,null,"<RotRel_X>0.000000</RotRel_X>"]
["RotRel_Y",0,null,"<RotRel_Y>0.000000</RotRel_Y>"]
["RotRel_Z",0,null,"<RotRel_Z>0.000000</RotRel_Z>"]
["Origin",0,null,"<Origin>0.000000</Origin>"]
["Density",1,null,"<Density>1.000000</Density>"]
["ShellMassArea",1,null,"<ShellMassArea>1.000000</ShellMassArea>"]
["RefFlag",0,null,{"$f":"\"<\" & A2900 & \">\" & TEXT(B2900,0) & \"</\" & A2900 & \">\"","v":"<RefFlag>0</RefFlag>"}]
["RefArea",100,null,{"$f":"\"<\" & A2901 & \">\" & TEXT(B2901,\"0.000000\") & \"</\" & A2901 & \">\"","v":"<RefArea>100.000000</RefArea>"}]
["RefSpan",10,null,{"$f":"\"<\" & A2902 & \">\" & TEXT(B2902,\"0.000000\") & \"</\" & A2902 & \">\"","v":"<RefSpan>10.000000</RefSpan>"}]
["RefCbar",1,null,{"$f":"\"<\" & A2903 & \">\" & TEXT(B2903,\"0.000000\") & \"</\" & A2903 & \">\"","v":"<RefCbar>1.000000</RefCbar>"}]
["AutoRefAreaFlag",1,null,{"$f":"\"<\" & A2904 & \">\" & TEXT(B2904,0) & \"</\" & A2904 & \">\"","v":"<AutoRefAreaFlag>1</AutoRefAreaFlag>"}]
["AutoRefSpanFlag",1,null,{"$f":"\"<\" & A2905 & \">\" & TEXT(B2905,0) & \"</\" & A2905 & \">\"","v":"<AutoRefSpanFlag>1</AutoRefSpanFlag>"}]
["AutoRefCbarFlag",1,null,{"$f":"\"<\" & A2906 & \">\" & TEXT(B2906,0) & \"</\" & A2906 & \">\"","v":"<AutoRefCbarFlag>1</AutoRefCbarFlag>"}]
["AeroCenter_X",0,null,{"$f":"\"<\" & A2907 & \">\" & TEXT(B2907,\"0.000000\") & \"</\" & A2907 & \">\"","v":"<AeroCenter_X>0.000000</AeroCenter_X>"}]
["AeroCenter_Y",0,null,{"$f":"\"<\" & A2908 & \">\" & TEXT(B2908,\"0.000000\") & \"</\" & A2908 & \">\"","v":"<AeroCenter_Y>0.000000</AeroCenter_Y>"}]
["AeroCenter_Z",0,null,{"$f":"\"<\" & A2909 & \">\" & TEXT(B2909,\"0.000000\") & \"</\" & A2909 & \">\"","v":"<AeroCenter_Z>0.000000</AeroCenter_Z>"}]
["AutoAeroCenterFlag",1,null,{"$f":"\"<\" & A2910 & \">\" & TEXT(B2910,0) & \"</\" & A2910 & \">\"","v":"<AutoAeroCenterFlag>1</AutoAeroCenterFlag>"}]
["WakeActiveFlag",0,null,{"$f":"\"<\" & A2911 & \">\" & TEXT(B2911,0) & \"</\" & A2911 & \">\"","v":"<WakeActiveFlag>0</WakeActiveFlag>"}]
["PosAttachFlag",3,null,{"$f":"\"<\" & A2912 & \">\" & TEXT(B2912,0) & \"</\" & A2912 & \">\"","v":"<PosAttachFlag>3</PosAttachFlag>"}]
["U_Attach",0,null,{"$f":"\"<\" & A2913 & \">\" & TEXT(B2913,\"0.000000\") & \"</\" & A2913 & \">\"","v":"<U_Attach>0.000000</U_Attach>"}]
["V_Attach",0,null,{"$f":"\"<\" & A2914 & \">\" & TEXT(B2914,\"0.000000\") & \"</\" & A2914 & \">\"","v":"<V_Attach>0.000000</V_Attach>"}]
["PtrID",149520864,null,{"$f":"\"<\" & A2915 & \">\" & TEXT(B2915,0) & \"</\" & A2915 & \">\"","v":"<PtrID>149520864</PtrID>"}]
["Parent_PtrID",149518280,null,{"$f":"\"<\" & A2916 & \">\" & TEXT(B2916,0) & \"</\" & A2916 & \">\"","v":"<Parent_PtrID>149518280</Parent_PtrID>"}]
["/General_Parms",null,null,{"$f":"\"<\" & A2917 & \">\"","v":"</General_Parms>"}]
["Engine_Parms",null,null,{"$f":"\"<\" & A2918 & \">\"","v":"<Engine_Parms>"}]
["Engine_Type",{"$f":"B1320","v":0},null,{"$f":"\"<\" & A2919 & \">\" & TEXT(B2919,0) & \"</\" & A2919 & \">\"","v":"<Engine_Type>0</Engine_Type>"}]
["Radius_Tip",0.84499999999999997,null,{"$f":"\"<\" & A2920 & \">\" & TEXT(B2920,\"0.000000\") & \"</\" & A2920 & \">\"","v":"<Radius_Tip>0.845000</Radius_Tip>"}]
["Max_Tip",1.3,null,{"$f":"\"<\" & A2921 & \">\" & TEXT(B2921,\"0.000000\") & \"</\" & A2921 & \">\"","v":"<Max_Tip>1.300000</Max_Tip>"}]
["Hub_Tip",0.5,null,{"$f":"\"<\" & A2922 & \">\" & TEXT(B2922,\"0.000000\") & \"</\" & A2922 & \">\"","v":"<Hub_Tip>0.500000</Hub_Tip>"}]
["Eng_Length",0,null,{"$f":"\"<\" & A2923 & \">\" & TEXT(B2923,\"0.000000\") & \"</\" & A2923 & \">\"","v":"<Eng_Length>0.000000</Eng_Length>"}]
["Inlet_Type",1,null,{"$f":"\"<\" & A2924 & \">\" & TEXT(B2924,0) & \"</\" & A2924 & \">\"","v":"<Inlet_Type>1</Inlet_Type>"}]
["Inl_Noz_Color",0,null,{"$f":"\"<\" & A2925 & \">\" & TEXT(B2925,0) & \"</\" & A2925 & \">\"","v":"<Inl_Noz_Color>0</Inl_Noz_Color>"}]
["Inlet_XY_Sym_Flag",0,null,{"$f":"\"<\" & A2926 & \">\" & TEXT(B2926,0) & \"</\" & A2926 & \">\"","v":"<Inlet_XY_Sym_Flag>0</Inlet_XY_Sym_Flag>"}]
["Inlet_Half_Split_Flag",0,null,{"$f":"\"<\" & A2927 & \">\" & TEXT(B2927,0) & \"</\" & A2927 & \">\"","v":"<Inlet_Half_Split_Flag>0</Inlet_Half_Split_Flag>"}]
["Cowl_Length",1E-3,null,{"$f":"\"<\" & A2928 & \">\" & TEXT(B2928,\"0.000000\") & \"</\" & A2928 & \">\"","v":"<Cowl_Length>0.001000</Cowl_Length>"}]
["Eng_Thrt_Ratio",1.5,null,"<Eng_Thrt_Ratio>1.500000</Eng_Thrt_Ratio>"]
["Hilight_Thrt_Ratio",1.3,null,"<Hilight_Thrt_Ratio>1.300000</Hilight_Thrt_Ratio>"]
["Lip_Finess_Ratio",1.9,null,"<Lip_Finess_Ratio>1.900000</Lip_Finess_Ratio>"]
["Height_Width_Ratio",1,null,"<Height_Width_Ratio>1.000000</Height_Width_Ratio>"]
["Upper_Surf_Shape_Factor",-1.3,null,"<Upper_Surf_Shape_Factor>-1.300000</Upper_Surf_Shape_Factor>"]
["Lower_Surf_Shape_Factor",0.7,null,"<Lower_Surf_Shape_Factor>0.700000</Lower_Surf_Shape_Factor>"]
["Inlet_X_Axis_Rot",0,null,"<Inlet_X_Axis_Rot>0.000000</Inlet_X_Axis_Rot>"]
["Inlet_Scarf_Angle",0,null,"<Inlet_Scarf_Angle>0.000000</Inlet_Scarf_Angle>"]
["Inlet_Duct_On_Off",0,null,{"$f":"\"<\" & A2937 & \">\" & TEXT(B2937,0) & \"</\" & A2937 & \">\"","v":"<Inlet_Duct_On_Off>0</Inlet_Duct_On_Off>"}]
["Inlet_Duct_X_Offset",3,null,{"$f":"\"<\" & A2938 & \">\" & TEXT(B2938,\"0.000000\") & \"</\" & A2938 & \">\"","v":"<Inlet_Duct_X_Offset>3.000000</Inlet_Duct_X_Offset>"}]
["Inlet_Duct_Y_Offset",1,null,{"$f":"\"<\" & A2939 & \">\" & TEXT(B2939,\"0.000000\") & \"</\" & A2939 & \">\"","v":"<Inlet_Duct_Y_Offset>1.000000</Inlet_Duct_Y_Offset>"}]
["Inlet_Duct_Shape_Factor",0.5,null,{"$f":"\"<\" & A2940 & \">\" & TEXT(B2940,\"0.000000\") & \"</\" & A2940 & \">\"","v":"<Inlet_Duct_Shape_Factor>0.500000</Inlet_Duct_Shape_Factor>"}]
["Divertor_On_Off",0,null,{"$f":"\"<\" & A2941 & \">\" & TEXT(B2941,0) & \"</\" & A2941 & \">\"","v":"<Divertor_On_Off>0</Divertor_On_Off>"}]
["Divertor_Height",0.5,null,{"$f":"\"<\" & A2942 & \">\" & TEXT(B2942,\"0.000000\") & \"</\" & A2942 & \">\"","v":"<Divertor_Height>0.500000</Divertor_Height>"}]
["Divertor_Length",1,null,{"$f":"\"<\" & A2943 & \">\" & TEXT(B2943,\"0.000000\") & \"</\" & A2943 & \">\"","v":"<Divertor_Length>1.000000</Divertor_Length>"}]
["Nozzle_Type",0,null,{"$f":"\"<\" & A2944 & \">\" & TEXT(B2944,0) & \"</\" & A2944 & \">\"","v":"<Nozzle_Type>0</Nozzle_Type>"}]
["Nozzle_Length",5.4907500000000011,null,{"$f":"\"<\" & A2945 & \">\" & TEXT(B2945,\"0.000000\") & \"</\" & A2945 & \">\"","v":"<Nozzle_Length>5.490750</Nozzle_Length>"}]
["Exit_Area_Ratio",3,null,{"$f":"\"<\" & A2946 & \">\" & TEXT(B2946,\"0.000000\") & \"</\" & A2946 & \">\"","v":"<Exit_Area_Ratio>3.000000</Exit_Area_Ratio>"}]
["Nozzle_Height_Width_Ratio",1,null,{"$f":"\"<\" & A2947 & \">\" & TEXT(B2947,\"0.000000\") & \"</\" & A2947 & \">\"","v":"<Nozzle_Height_Width_Ratio>1.000000</Nozzle_Height_Width_Ratio>"}]
["Exit_Throat_Ratio",1.5,null,{"$f":"\"<\" & A2948 & \">\" & TEXT(B2948,\"0.000000\") & \"</\" & A2948 & \">\"","v":"<Exit_Throat_Ratio>1.500000</Exit_Throat_Ratio>"}]
["Dive_Flap_Ratio",1,null,{"$f":"\"<\" & A2949 & \">\" & TEXT(B2949,\"0.000000\") & \"</\" & A2949 & \">\"","v":"<Dive_Flap_Ratio>1.000000</Dive_Flap_Ratio>"}]
["Nozzle_Duct_On_Off",0,null,{"$f":"\"<\" & A2950 & \">\" & TEXT(B2950,0) & \"</\" & A2950 & \">\"","v":"<Nozzle_Duct_On_Off>0</Nozzle_Duct_On_Off>"}]
["Nozzle_Duct_X_Offset",1,null,{"$f":"\"<\" & A2951 & \">\" & TEXT(B2951,\"0.000000\") & \"</\" & A2951 & \">\"","v":"<Nozzle_Duct_X_Offset>1.000000</Nozzle_Duct_X_Offset>"}]
["Nozzle_Duct_Y_Offset",0,null,{"$f":"\"<\" & A2952 & \">\" & TEXT(B2952,\"0.000000\") & \"</\" & A2952 & \">\"","v":"<Nozzle_Duct_Y_Offset>0.000000</Nozzle_Duct_Y_Offset>"}]
["Nozzle_Duct_Shape_Factor",0,null,{"$f":"\"<\" & A2953 & \">\" & TEXT(B2953,\"0.000000\") & \"</\" & A2953 & \">\"","v":"<Nozzle_Duct_Shape_Factor>0.000000</Nozzle_Duct_Shape_Factor>"}]
["/Engine_Parms",null,null,{"$f":"\"<\" & A2954 & \">\"","v":"</Engine_Parms>"}]
["/Component",null,null,{"$f":"\"<\" & A2955 & \">\"","v":"</Component>"}]
["Component","Prop Rotor",{"$f":"IF(Input!$D$27>=4,IF(Input!$D$26=\"Jet\",\"No\",\"Yes\"),\"Yes\")","v":"Yes"},{"$f":"IF(C2956=\"Yes\",(\"<\"&A2956&\">\"),(\"<!--\"&A2956&\">\"))","v":"<Component>"}]
["Type","Prop",null,{"$f":"\"<\" & A2957 & \">\" & TEXT(B2957,\"0.000000\") & \"</\" & A2957 & \">\"","v":"<Type>Prop</Type>"}]
["General_Parms",null,null,{"$f":"\"<\" & A2958 & \">\"","v":"<General_Parms>"}]
["Name",{"$f":"B1360","v":"Rotor"},null,{"$f":"\"<\" & A2959 & \">\" & TEXT(B2959,\"0.000000\") & \"</\" & A2959 & \">\"","v":"<Name>Rotor</Name>"}]
["ColorR",127,null,{"$f":"\"<\" & A2960 & \">\" & TEXT(B2960,\"0.000000\") & \"</\" & A2960 & \">\"","v":"<ColorR>127.000000</ColorR>"}]
["ColorG",127,null,{"$f":"\"<\" & A2961 & \">\" & TEXT(B2961,\"0.000000\") & \"</\" & A2961 & \">\"","v":"<ColorG>127.000000</ColorG>"}]
["ColorB",127,null,{"$f":"\"<\" & A2962 & \">\" & TEXT(B2962,\"0.000000\") & \"</\" & A2962 & \">\"","v":"<ColorB>127.000000</ColorB>"}]
["Symmetry",0,null,{"$f":"\"<\" & A2963 & \">\" & TEXT(B2963,0) & \"</\" & A2963 & \">\"","v":"<Symmetry>0</Symmetry>"}]
["RelXFormFlag",0,null,"<RelXFormFlag>0</RelXFormFlag>"]
["MaterialID",0,null,"<MaterialID>0</MaterialID>"]
["OutputFlag",1,null,"<OutputFlag>1</OutputFlag>"]
["OutputNameID",0,null,"<OutputNameID>0</OutputNameID>"]
["DisplayChildrenFlag",1,null,"<DisplayChildrenFlag>1</DisplayChildrenFlag>"]
["NumPnts",21,null,"<NumPnts>21</NumPnts>"]
["NumXsecs",11,null,"<NumXsecs>11</NumXsecs>"]
["MassPrior",0,null,"<MassPrior>0</MassPrior>"]
["ShellFlag",0,null,"<ShellFlag>0</ShellFlag>"]
["Tran_X",0,null,{"$f":"\"<\" & A2973 & \">\" & TEXT(B2973,\"0.000000\") & \"</\" & A2973 & \">\"","v":"<Tran_X>0.000000</Tran_X>"}]
["Tran_Y",0,null,"<Tran_Y>0.000000</Tran_Y>"]
["Tran_Z",0,null,"<Tran_Z>0.000000</Tran_Z>"]
["TranRel_X",0,null,"<TranRel_X>0.000000</TranRel_X>"]
["TranRel_Y",0,null,"<TranRel_Y>0.000000</TranRel_Y>"]
["TranRel_Z",0,null,"<TranRel_Z>0.000000</TranRel_Z>"]
["Rot_X",0,null,"<Rot_X>0.000000</Rot_X>"]
["Rot_Y",0,null,"<Rot_Y>0.000000</Rot_Y>"]
["Rot_Z",0,null,"<Rot_Z>0.000000</Rot_Z>"]
["RotRel_X",0,null,"<RotRel_X>0.000000</RotRel_X>"]
["RotRel_Y",0,null,"<RotRel_Y>0.000000</RotRel_Y>"]
["RotRel_Z",0,null,"<RotRel_Z>0.000000</RotRel_Z>"]
["Origin",0,null,"<Origin>0.000000</Origin>"]
["Density",1,null,"<Density>1.000000</Density>"]
["ShellMassArea",1,null,"<ShellMassArea>1.000000</ShellMassArea>"]
["RefFlag",0,null,{"$f":"\"<\" & A2988 & \">\" & TEXT(B2988,0) & \"</\" & A2988 & \">\"","v":"<RefFlag>0</RefFlag>"}]
["RefArea",100,null,{"$f":"\"<\" & A2989 & \">\" & TEXT(B2989,\"0.000000\") & \"</\" & A2989 & \">\"","v":"<RefArea>100.000000</RefArea>"}]
["RefSpan",10,null,{"$f":"\"<\" & A2990 & \">\" & TEXT(B2990,\"0.000000\") & \"</\" & A2990 & \">\"","v":"<RefSpan>10.000000</RefSpan>"}]
["RefCbar",1,null,{"$f":"\"<\" & A2991 & \">\" & TEXT(B2991,\"0.000000\") & \"</\" & A2991 & \">\"","v":"<RefCbar>1.000000</RefCbar>"}]
["AutoRefAreaFlag",1,null,{"$f":"\"<\" & A2992 & \">\" & TEXT(B2992,0) & \"</\" & A2992 & \">\"","v":"<AutoRefAreaFlag>1</AutoRefAreaFlag>"}]
["AutoRefSpanFlag",1,null,{"$f":"\"<\" & A2993 & \">\" & TEXT(B2993,0) & \"</\" & A2993 & \">\"","v":"<AutoRefSpanFlag>1</AutoRefSpanFlag>"}]
["AutoRefCbarFlag",1,null,{"$f":"\"<\" & A2994 & \">\" & TEXT(B2994,0) & \"</\" & A2994 & \">\"","v":"<AutoRefCbarFlag>1</AutoRefCbarFlag>"}]
["AeroCenter_X",0,null,{"$f":"\"<\" & A2995 & \">\" & TEXT(B2995,\"0.000000\") & \"</\" & A2995 & \">\"","v":"<AeroCenter_X>0.000000</AeroCenter_X>"}]
["AeroCenter_Y",0,null,{"$f":"\"<\" & A2996 & \">\" & TEXT(B2996,\"0.000000\") & \"</\" & A2996 & \">\"","v":"<AeroCenter_Y>0.000000</AeroCenter_Y>"}]
["AeroCenter_Z",0,null,{"$f":"\"<\" & A2997 & \">\" & TEXT(B2997,\"0.000000\") & \"</\" & A2997 & \">\"","v":"<AeroCenter_Z>0.000000</AeroCenter_Z>"}]
["AutoAeroCenterFlag",1,null,{"$f":"\"<\" & A2998 & \">\" & TEXT(B2998,0) & \"</\" & A2998 & \">\"","v":"<AutoAeroCenterFlag>1</AutoAeroCenterFlag>"}]
["WakeActiveFlag",0,null,{"$f":"\"<\" & A2999 & \">\" & TEXT(B2999,0) & \"</\" & A2999 & \">\"","v":"<WakeActiveFlag>0</WakeActiveFlag>"}]
["PosAttachFlag",3,null,{"$f":"\"<\" & A3000 & \">\" & TEXT(B3000,0) & \"</\" & A3000 & \">\"","v":"<PosAttachFlag>3</PosAttachFlag>"}]
["U_Attach",0,null,{"$f":"\"<\" & A3001 & \">\" & TEXT(B3001,\"0.000000\") & \"</\" & A3001 & \">\"","v":"<U_Attach>0.000000</U_Attach>"}]
["V_Attach",0,null,{"$f":"\"<\" & A3002 & \">\" & TEXT(B3002,\"0.000000\") & \"</\" & A3002 & \">\"","v":"<V_Attach>0.000000</V_Attach>"}]
["PtrID",60521,null,{"$f":"\"<\" & A3003 & \">\" & TEXT(B3003,0) & \"</\" & A3003 & \">\"","v":"<PtrID>60521</PtrID>"}]
["Parent_PtrID",149518280,null,{"$f":"\"<\" & A3004 & \">\" & TEXT(B3004,0) & \"</\" & A3004 & \">\"","v":"<Parent_PtrID>149518280</Parent_PtrID>"}]
["/General_Parms",null,null,{"$f":"\"<\" & A3005 & \">\"","v":"</General_Parms>"}]
["Prop_Parms",null,null,{"$f":"\"<\" & A3006 & \">\"","v":"<Prop_Parms>"}]
["NumBlades",{"$f":"B1408","v":6},null,{"$f":"\"<\" & A3007 & \">\" & TEXT(B3007,0) & \"</\" & A3007 & \">\"","v":"<NumBlades>6</NumBlades>"}]
["SmoothFlag",1,null,{"$f":"\"<\" & A3008 & \">\" & TEXT(B3008,0) & \"</\" & A3008 & \">\"","v":"<SmoothFlag>1</SmoothFlag>"}]
["NumU",3,null,{"$f":"\"<\" & A3009 & \">\" & TEXT(B3009,0) & \"</\" & A3009 & \">\"","v":"<NumU>3</NumU>"}]
["NumW",1,null,{"$f":"\"<\" & A3010 & \">\" & TEXT(B3010,0) & \"</\" & A3010 & \">\"","v":"<NumW>1</NumW>"}]
["Diameter",3.8910028638910115,null,{"$f":"\"<\" & A3011 & \">\" & TEXT(B3011,\"0.000000\") & \"</\" & A3011 & \">\"","v":"<Diameter>3.891003</Diameter>"}]
["ConeAngle",0,null,{"$f":"\"<\" & A3012 & \">\" & TEXT(B3012,\"0.000000\") & \"</\" & A3012 & \">\"","v":"<ConeAngle>0.000000</ConeAngle>"}]
["Pitch",0,null,{"$f":"\"<\" & A3013 & \">\" & TEXT(B3013,\"0.000000\") & \"</\" & A3013 & \">\"","v":"<Pitch>0.000000</Pitch>"}]
["Sect_Parms","Section0",null,{"$f":"\"<\" & A3014 & \">\"","v":"<Sect_Parms>"}]
["X_Off",{"$f":"B1416","v":0.05},null,{"$f":"\"<\" & A3015 & \">\" & TEXT(B3015,\"0.000000\") & \"</\" & A3015 & \">\"","v":"<X_Off>0.050000</X_Off>"}]
["Y_Off",{"$f":"B1417","v":0},null,{"$f":"\"<\" & A3016 & \">\" & TEXT(B3016,\"0.000000\") & \"</\" & A3016 & \">\"","v":"<Y_Off>0.000000</Y_Off>"}]
["Chord",{"$f":"B1418","v":0.08},null,{"$f":"\"<\" & A3017 & \">\" & TEXT(B3017,\"0.000000\") & \"</\" & A3017 & \">\"","v":"<Chord>0.080000</Chord>"}]
["Twist",{"$f":"B1419","v":45},null,{"$f":"\"<\" & A3018 & \">\" & TEXT(B3018,\"0.000000\") & \"</\" & A3018 & \">\"","v":"<Twist>45.000000</Twist>"}]
["Airfoil",null,null,{"$f":"\"<\" & A3019 & \">\"","v":"<Airfoil>"}]
["Type",{"$f":"B1421","v":1},null,{"$f":"\"<\" & A3020 & \">\" & TEXT(B3020,0) & \"</\" & A3020 & \">\"","v":"<Type>1</Type>"}]
["Inverted_Flag",0,null,{"$f":"\"<\" & A3021 & \">\" & TEXT(B3021,0) & \"</\" & A3021 & \">\"","v":"<Inverted_Flag>0</Inverted_Flag>"}]
["Camber",0,null,{"$f":"\"<\" & A3022 & \">\" & TEXT(B3022,\"0.000000\") & \"</\" & A3022 & \">\"","v":"<Camber>0.000000</Camber>"}]
["Camber_Loc",0.5,null,"<Camber_Loc>0.500000</Camber_Loc>"]
["Thickness",0.2,null,"<Thickness>0.200000</Thickness>"]
["Thickness_Loc",0.3,null,"<Thickness_Loc>0.300000</Thickness_Loc>"]
["Radius_Le",4.4075999999999997E-2,null,"<Radius_Le>0.044076</Radius_Le>"]
["Radius_Te",0,null,"<Radius_Te>0.000000</Radius_Te>"]
["Six_Series",63,null,{"$f":"\"<\" & A3028 & \">\" & TEXT(B3028,0) & \"</\" & A3028 & \">\"","v":"<Six_Series>63</Six_Series>"}]
["Ideal_Cl",0,null,{"$f":"\"<\" & A3029 & \">\" & TEXT(B3029,\"0.000000\") & \"</\" & A3029 & \">\"","v":"<Ideal_Cl>0.000000</Ideal_Cl>"}]
["A",0,null,{"$f":"\"<\" & A3030 & \">\" & TEXT(B3030,\"0.000000\") & \"</\" & A3030 & \">\"","v":"<A>0.000000</A>"}]
["Slat_Flag",0,null,{"$f":"\"<\" & A3031 & \">\" & TEXT(B3031,0) & \"</\" & A3031 & \">\"","v":"<Slat_Flag>0</Slat_Flag>"}]
["Slat_Shear_Flag",0,null,{"$f":"\"<\" & A3032 & \">\" & TEXT(B3032,0) & \"</\" & A3032 & \">\"","v":"<Slat_Shear_Flag>0</Slat_Shear_Flag>"}]
["Slat_Chord",0.25,null,{"$f":"\"<\" & A3033 & \">\" & TEXT(B3033,\"0.000000\") & \"</\" & A3033 & \">\"","v":"<Slat_Chord>0.250000</Slat_Chord>"}]
["Slat_Angle",10,null,{"$f":"\"<\" & A3034 & \">\" & TEXT(B3034,\"0.000000\") & \"</\" & A3034 & \">\"","v":"<Slat_Angle>10.000000</Slat_Angle>"}]
["Flap_Flag",0,null,{"$f":"\"<\" & A3035 & \">\" & TEXT(B3035,0) & \"</\" & A3035 & \">\"","v":"<Flap_Flag>0</Flap_Flag>"}]
["Flap_Shear_Flag",0,null,{"$f":"\"<\" & A3036 & \">\" & TEXT(B3036,0) & \"</\" & A3036 & \">\"","v":"<Flap_Shear_Flag>0</Flap_Shear_Flag>"}]
["Flap_Chord",0.25,null,{"$f":"\"<\" & A3037 & \">\" & TEXT(B3037,\"0.000000\") & \"</\" & A3037 & \">\"","v":"<Flap_Chord>0.250000</Flap_Chord>"}]
["Flap_Angle",10,null,{"$f":"\"<\" & A3038 & \">\" & TEXT(B3038,\"0.000000\") & \"</\" & A3038 & \">\"","v":"<Flap_Angle>10.000000</Flap_Angle>"}]
["/Airfoil",null,null,{"$f":"\"<\" & A3039 & \">\"","v":"</Airfoil>"}]
["/Sect_Parms",null,null,{"$f":"\"<\" & A3040 & \">\"","v":"</Sect_Parms>"}]
["Sect_Parms","Section1",null,{"$f":"\"<\" & A3041 & \">\"","v":"<Sect_Parms>"}]
["X_Off",{"$f":"B1443","v":0.5},null,{"$f":"\"<\" & A3042 & \">\" & TEXT(B3042,\"0.000000\") & \"</\" & A3042 & \">\"","v":"<X_Off>0.500000</X_Off>"}]
["Y_Off",{"$f":"B1444","v":0},null,{"$f":"\"<\" & A3043 & \">\" & TEXT(B3043,\"0.000000\") & \"</\" & A3043 & \">\"","v":"<Y_Off>0.000000</Y_Off>"}]
["Chord",{"$f":"B1445","v":0.12},null,{"$f":"\"<\" & A3044 & \">\" & TEXT(B3044,\"0.000000\") & \"</\" & A3044 & \">\"","v":"<Chord>0.120000</Chord>"}]
["Twist",{"$f":"B1446","v":15},null,{"$f":"\"<\" & A3045 & \">\" & TEXT(B3045,\"0.000000\") & \"</\" & A3045 & \">\"","v":"<Twist>15.000000</Twist>"}]
["Airfoil",null,null,{"$f":"\"<\" & A3046 & \">\"","v":"<Airfoil>"}]
["Type",{"$f":"B1448","v":1},null,{"$f":"\"<\" & A3047 & \">\" & TEXT(B3047,0) & \"</\" & A3047 & \">\"","v":"<Type>1</Type>"}]
["Inverted_Flag",0,null,{"$f":"\"<\" & A3048 & \">\" & TEXT(B3048,0) & \"</\" & A3048 & \">\"","v":"<Inverted_Flag>0</Inverted_Flag>"}]
["Camber",0,null,{"$f":"\"<\" & A3049 & \">\" & TEXT(B3049,\"0.000000\") & \"</\" & A3049 & \">\"","v":"<Camber>0.000000</Camber>"}]
["Camber_Loc",0.5,null,"<Camber_Loc>0.500000</Camber_Loc>"]
["Thickness",0.2,null,"<Thickness>0.200000</Thickness>"]
["Thickness_Loc",0.3,null,"<Thickness_Loc>0.300000</Thickness_Loc>"]
["Radius_Le",4.4075999999999997E-2,null,"<Radius_Le>0.044076</Radius_Le>"]
["Radius_Te",0,null,"<Radius_Te>0.000000</Radius_Te>"]
["Six_Series",63,null,{"$f":"\"<\" & A3055 & \">\" & TEXT(B3055,0) & \"</\" & A3055 & \">\"","v":"<Six_Series>63</Six_Series>"}]
["Ideal_Cl",0,null,{"$f":"\"<\" & A3056 & \">\" & TEXT(B3056,\"0.000000\") & \"</\" & A3056 & \">\"","v":"<Ideal_Cl>0.000000</Ideal_Cl>"}]
["A",0,null,{"$f":"\"<\" & A3057 & \">\" & TEXT(B3057,\"0.000000\") & \"</\" & A3057 & \">\"","v":"<A>0.000000</A>"}]
["Slat_Flag",0,null,{"$f":"\"<\" & A3058 & \">\" & TEXT(B3058,0) & \"</\" & A3058 & \">\"","v":"<Slat_Flag>0</Slat_Flag>"}]
["Slat_Shear_Flag",0,null,{"$f":"\"<\" & A3059 & \">\" & TEXT(B3059,0) & \"</\" & A3059 & \">\"","v":"<Slat_Shear_Flag>0</Slat_Shear_Flag>"}]
["Slat_Chord",0.25,null,{"$f":"\"<\" & A3060 & \">\" & TEXT(B3060,\"0.000000\") & \"</\" & A3060 & \">\"","v":"<Slat_Chord>0.250000</Slat_Chord>"}]
["Slat_Angle",10,null,{"$f":"\"<\" & A3061 & \">\" & TEXT(B3061,\"0.000000\") & \"</\" & A3061 & \">\"","v":"<Slat_Angle>10.000000</Slat_Angle>"}]
["Flap_Flag",0,null,{"$f":"\"<\" & A3062 & \">\" & TEXT(B3062,0) & \"</\" & A3062 & \">\"","v":"<Flap_Flag>0</Flap_Flag>"}]
["Flap_Shear_Flag",0,null,{"$f":"\"<\" & A3063 & \">\" & TEXT(B3063,0) & \"</\" & A3063 & \">\"","v":"<Flap_Shear_Flag>0</Flap_Shear_Flag>"}]
["Flap_Chord",0.25,null,{"$f":"\"<\" & A3064 & \">\" & TEXT(B3064,\"0.000000\") & \"</\" & A3064 & \">\"","v":"<Flap_Chord>0.250000</Flap_Chord>"}]
["Flap_Angle",10,null,{"$f":"\"<\" & A3065 & \">\" & TEXT(B3065,\"0.000000\") & \"</\" & A3065 & \">\"","v":"<Flap_Angle>10.000000</Flap_Angle>"}]
["/Airfoil",null,null,{"$f":"\"<\" & A3066 & \">\"","v":"</Airfoil>"}]
["/Sect_Parms",null,null,{"$f":"\"<\" & A3067 & \">\"","v":"</Sect_Parms>"}]
["Sect_Parms","Section2",null,{"$f":"\"<\" & A3068 & \">\"","v":"<Sect_Parms>"}]
["X_Off",{"$f":"B1470","v":0.9},null,{"$f":"\"<\" & A3069 & \">\" & TEXT(B3069,\"0.000000\") & \"</\" & A3069 & \">\"","v":"<X_Off>0.900000</X_Off>"}]
["Y_Off",{"$f":"B1471","v":0},null,{"$f":"\"<\" & A3070 & \">\" & TEXT(B3070,\"0.000000\") & \"</\" & A3070 & \">\"","v":"<Y_Off>0.000000</Y_Off>"}]
["Chord",{"$f":"B1472","v":7.0000000000000007E-2},null,{"$f":"\"<\" & A3071 & \">\" & TEXT(B3071,\"0.000000\") & \"</\" & A3071 & \">\"","v":"<Chord>0.070000</Chord>"}]
["Twist",{"$f":"B1473","v":5},null,{"$f":"\"<\" & A3072 & \">\" & TEXT(B3072,\"0.000000\") & \"</\" & A3072 & \">\"","v":"<Twist>5.000000</Twist>"}]
["Airfoil",null,null,{"$f":"\"<\" & A3073 & \">\"","v":"<Airfoil>"}]
["Type",{"$f":"B1475","v":1},null,{"$f":"\"<\" & A3074 & \">\" & TEXT(B3074,0) & \"</\" & A3074 & \">\"","v":"<Type>1</Type>"}]
["Inverted_Flag",0,null,{"$f":"\"<\" & A3075 & \">\" & TEXT(B3075,0) & \"</\" & A3075 & \">\"","v":"<Inverted_Flag>0</Inverted_Flag>"}]
["Camber",0,null,{"$f":"\"<\" & A3076 & \">\" & TEXT(B3076,\"0.000000\") & \"</\" & A3076 & \">\"","v":"<Camber>0.000000</Camber>"}]
["Camber_Loc",0.5,null,"<Camber_Loc>0.500000</Camber_Loc>"]
["Thickness",0.2,null,"<Thickness>0.200000</Thickness>"]
["Thickness_Loc",0.3,null,"<Thickness_Loc>0.300000</Thickness_Loc>"]
["Radius_Le",4.4075999999999997E-2,null,"<Radius_Le>0.044076</Radius_Le>"]
["Radius_Te",0,null,"<Radius_Te>0.000000</Radius_Te>"]
["Six_Series",63,null,{"$f":"\"<\" & A3082 & \">\" & TEXT(B3082,0) & \"</\" & A3082 & \">\"","v":"<Six_Series>63</Six_Series>"}]
["Ideal_Cl",0,null,{"$f":"\"<\" & A3083 & \">\" & TEXT(B3083,\"0.000000\") & \"</\" & A3083 & \">\"","v":"<Ideal_Cl>0.000000</Ideal_Cl>"}]
["A",0,null,{"$f":"\"<\" & A3084 & \">\" & TEXT(B3084,\"0.000000\") & \"</\" & A3084 & \">\"","v":"<A>0.000000</A>"}]
["Slat_Flag",0,null,{"$f":"\"<\" & A3085 & \">\" & TEXT(B3085,0) & \"</\" & A3085 & \">\"","v":"<Slat_Flag>0</Slat_Flag>"}]
["Slat_Shear_Flag",0,null,{"$f":"\"<\" & A3086 & \">\" & TEXT(B3086,0) & \"</\" & A3086 & \">\"","v":"<Slat_Shear_Flag>0</Slat_Shear_Flag>"}]
["Slat_Chord",0.25,null,{"$f":"\"<\" & A3087 & \">\" & TEXT(B3087,\"0.000000\") & \"</\" & A3087 & \">\"","v":"<Slat_Chord>0.250000</Slat_Chord>"}]
["Slat_Angle",10,null,{"$f":"\"<\" & A3088 & \">\" & TEXT(B3088,\"0.000000\") & \"</\" & A3088 & \">\"","v":"<Slat_Angle>10.000000</Slat_Angle>"}]
["Flap_Flag",0,null,{"$f":"\"<\" & A3089 & \">\" & TEXT(B3089,0) & \"</\" & A3089 & \">\"","v":"<Flap_Flag>0</Flap_Flag>"}]
["Flap_Shear_Flag",0,null,{"$f":"\"<\" & A3090 & \">\" & TEXT(B3090,0) & \"</\" & A3090 & \">\"","v":"<Flap_Shear_Flag>0</Flap_Shear_Flag>"}]
["Flap_Chord",0.25,null,{"$f":"\"<\" & A3091 & \">\" & TEXT(B3091,\"0.000000\") & \"</\" & A3091 & \">\"","v":"<Flap_Chord>0.250000</Flap_Chord>"}]
["Flap_Angle",10,null,{"$f":"\"<\" & A3092 & \">\" & TEXT(B3092,\"0.000000\") & \"</\" & A3092 & \">\"","v":"<Flap_Angle>10.000000</Flap_Angle>"}]
["/Airfoil",null,null,{"$f":"\"<\" & A3093 & \">\"","v":"</Airfoil>"}]
["/Sect_Parms",null,null,{"$f":"\"<\" & A3094 & \">\"","v":"</Sect_Parms>"}]
["Sect_Parms","Section3",null,{"$f":"\"<\" & A3095 & \">\"","v":"<Sect_Parms>"}]
["X_Off",{"$f":"B1497","v":1},null,{"$f":"\"<\" & A3096 & \">\" & TEXT(B3096,\"0.000000\") & \"</\" & A3096 & \">\"","v":"<X_Off>1.000000</X_Off>"}]
["Y_Off",{"$f":"B1498","v":0},null,{"$f":"\"<\" & A3097 & \">\" & TEXT(B3097,\"0.000000\") & \"</\" & A3097 & \">\"","v":"<Y_Off>0.000000</Y_Off>"}]
["Chord",{"$f":"B1499","v":0.02},null,{"$f":"\"<\" & A3098 & \">\" & TEXT(B3098,\"0.000000\") & \"</\" & A3098 & \">\"","v":"<Chord>0.020000</Chord>"}]
["Twist",{"$f":"B1500","v":2},null,{"$f":"\"<\" & A3099 & \">\" & TEXT(B3099,\"0.000000\") & \"</\" & A3099 & \">\"","v":"<Twist>2.000000</Twist>"}]
["Airfoil",null,null,{"$f":"\"<\" & A3100 & \">\"","v":"<Airfoil>"}]
["Type",{"$f":"B1502","v":1},null,{"$f":"\"<\" & A3101 & \">\" & TEXT(B3101,0) & \"</\" & A3101 & \">\"","v":"<Type>1</Type>"}]
["Inverted_Flag",0,null,{"$f":"\"<\" & A3102 & \">\" & TEXT(B3102,0) & \"</\" & A3102 & \">\"","v":"<Inverted_Flag>0</Inverted_Flag>"}]
["Camber",0,null,{"$f":"\"<\" & A3103 & \">\" & TEXT(B3103,\"0.000000\") & \"</\" & A3103 & \">\"","v":"<Camber>0.000000</Camber>"}]
["Camber_Loc",0.5,null,"<Camber_Loc>0.500000</Camber_Loc>"]
["Thickness",0.2,null,"<Thickness>0.200000</Thickness>"]
["Thickness_Loc",0.3,null,"<Thickness_Loc>0.300000</Thickness_Loc>"]
["Radius_Le",4.4075999999999997E-2,null,"<Radius_Le>0.044076</Radius_Le>"]
["Radius_Te",0,null,"<Radius_Te>0.000000</Radius_Te>"]
["Six_Series",63,null,{"$f":"\"<\" & A3109 & \">\" & TEXT(B3109,0) & \"</\" & A3109 & \">\"","v":"<Six_Series>63</Six_Series>"}]
["Ideal_Cl",0,null,{"$f":"\"<\" & A3110 & \">\" & TEXT(B3110,\"0.000000\") & \"</\" & A3110 & \">\"","v":"<Ideal_Cl>0.000000</Ideal_Cl>"}]
["A",0,null,{"$f":"\"<\" & A3111 & \">\" & TEXT(B3111,\"0.000000\") & \"</\" & A3111 & \">\"","v":"<A>0.000000</A>"}]
["Slat_Flag",0,null,{"$f":"\"<\" & A3112 & \">\" & TEXT(B3112,0) & \"</\" & A3112 & \">\"","v":"<Slat_Flag>0</Slat_Flag>"}]
["Slat_Shear_Flag",0,null,{"$f":"\"<\" & A3113 & \">\" & TEXT(B3113,0) & \"</\" & A3113 & \">\"","v":"<Slat_Shear_Flag>0</Slat_Shear_Flag>"}]
["Slat_Chord",0.25,null,{"$f":"\"<\" & A3114 & \">\" & TEXT(B3114,\"0.000000\") & \"</\" & A3114 & \">\"","v":"<Slat_Chord>0.250000</Slat_Chord>"}]
["Slat_Angle",10,null,{"$f":"\"<\" & A3115 & \">\" & TEXT(B3115,\"0.000000\") & \"</\" & A3115 & \">\"","v":"<Slat_Angle>10.000000</Slat_Angle>"}]
["Flap_Flag",0,null,{"$f":"\"<\" & A3116 & \">\" & TEXT(B3116,0) & \"</\" & A3116 & \">\"","v":"<Flap_Flag>0</Flap_Flag>"}]
["Flap_Shear_Flag",0,null,{"$f":"\"<\" & A3117 & \">\" & TEXT(B3117,0) & \"</\" & A3117 & \">\"","v":"<Flap_Shear_Flag>0</Flap_Shear_Flag>"}]
["Flap_Chord",0.25,null,{"$f":"\"<\" & A3118 & \">\" & TEXT(B3118,\"0.000000\") & \"</\" & A3118 & \">\"","v":"<Flap_Chord>0.250000</Flap_Chord>"}]
["Flap_Angle",10,null,{"$f":"\"<\" & A3119 & \">\" & TEXT(B3119,\"0.000000\") & \"</\" & A3119 & \">\"","v":"<Flap_Angle>10.000000</Flap_Angle>"}]
["/Airfoil",null,null,{"$f":"\"<\" & A3120 & \">\"","v":"</Airfoil>"}]
["/Sect_Parms",null,null,{"$f":"\"<\" & A3121 & \">\"","v":"</Sect_Parms>"}]
["/Prop_Parms",null,null,{"$f":"\"<\" & A3122 & \">\"","v":"</Prop_Parms>"}]
["/Component",null,{"$f":"C2956","v":"Yes"},{"$f":"IF(C3123=\"Yes\",(\"<\"&A3123&\">\"),(\"<\"&A3123&\"-->\"))","v":"</Component>"}]
["Component","Pylon",{"$f":"IF(Input!$D$27>=4,IF(Input!$D$26=\"Jet\",\"Yes\",\"No\"),\"Yes\")","v":"Yes"},{"$f":"IF(C3124=\"Yes\",(\"<\"&A3124&\">\"),(\"<!--\"&A3124&\">\"))","v":"<Component>"}]
["Type","Mswing",null,{"$f":"\"<\" & A3125 & \">\" & TEXT(B3125,\"0.000000\") & \"</\" & A3125 & \">\"","v":"<Type>Mswing</Type>"}]
["General_Parms",null,null,{"$f":"\"<\" & A3126 & \">\"","v":"<General_Parms>"}]
["Name",{"$f":"B1528","v":"pylon"},null,{"$f":"\"<\" & A3127 & \">\" & TEXT(B3127,\"0.000000\") & \"</\" & A3127 & \">\"","v":"<Name>pylon</Name>"}]
["ColorR",0,null,{"$f":"\"<\" & A3128 & \">\" & TEXT(B3128,\"0.000000\") & \"</\" & A3128 & \">\"","v":"<ColorR>0.000000</ColorR>"}]
["ColorG",255,null,{"$f":"\"<\" & A3129 & \">\" & TEXT(B3129,\"0.000000\") & \"</\" & A3129 & \">\"","v":"<ColorG>255.000000</ColorG>"}]
["ColorB",0,null,{"$f":"\"<\" & A3130 & \">\" & TEXT(B3130,\"0.000000\") & \"</\" & A3130 & \">\"","v":"<ColorB>0.000000</ColorB>"}]
["Symmetry",0,null,{"$f":"\"<\" & A3131 & \">\" & TEXT(B3131,0) & \"</\" & A3131 & \">\"","v":"<Symmetry>0</Symmetry>"}]
["RelXFormFlag",0,null,"<RelXFormFlag>0</RelXFormFlag>"]
["MaterialID",2,null,"<MaterialID>2</MaterialID>"]
["OutputFlag",1,null,"<OutputFlag>1</OutputFlag>"]
["OutputNameID",0,null,"<OutputNameID>0</OutputNameID>"]
["DisplayChildrenFlag",1,null,"<DisplayChildrenFlag>1</DisplayChildrenFlag>"]
["NumPnts",21,null,"<NumPnts>21</NumPnts>"]
["NumXsecs",11,null,"<NumXsecs>11</NumXsecs>"]
["MassPrior",0,null,"<MassPrior>0</MassPrior>"]
["ShellFlag",0,null,"<ShellFlag>0</ShellFlag>"]
["Tran_X",0,null,{"$f":"\"<\" & A3141 & \">\" & TEXT(B3141,\"0.000000\") & \"</\" & A3141 & \">\"","v":"<Tran_X>0.000000</Tran_X>"}]
["Tran_Y",0,null,"<Tran_Y>0.000000</Tran_Y>"]
["Tran_Z",1.69,null,"<Tran_Z>1.690000</Tran_Z>"]
["TranRel_X",0,null,"<TranRel_X>0.000000</TranRel_X>"]
["TranRel_Y",0,null,"<TranRel_Y>0.000000</TranRel_Y>"]
["TranRel_Z",0,null,"<TranRel_Z>0.000000</TranRel_Z>"]
["Rot_X",90,null,"<Rot_X>90.000000</Rot_X>"]
["Rot_Y",0,null,"<Rot_Y>0.000000</Rot_Y>"]
["Rot_Z",0,null,"<Rot_Z>0.000000</Rot_Z>"]
["RotRel_X",0,null,"<RotRel_X>0.000000</RotRel_X>"]
["RotRel_Y",0,null,"<RotRel_Y>0.000000</RotRel_Y>"]
["RotRel_Z",0,null,"<RotRel_Z>0.000000</RotRel_Z>"]
["Origin",0,null,"<Origin>0.000000</Origin>"]
["Density",1,null,"<Density>1.000000</Density>"]
["ShellMassArea",1,null,"<ShellMassArea>1.000000</ShellMassArea>"]
["RefFlag",0,null,{"$f":"\"<\" & A3156 & \">\" & TEXT(B3156,0) & \"</\" & A3156 & \">\"","v":"<RefFlag>0</RefFlag>"}]
["RefArea",100,null,{"$f":"\"<\" & A3157 & \">\" & TEXT(B3157,\"0.000000\") & \"</\" & A3157 & \">\"","v":"<RefArea>100.000000</RefArea>"}]
["RefSpan",10,null,{"$f":"\"<\" & A3158 & \">\" & TEXT(B3158,\"0.000000\") & \"</\" & A3158 & \">\"","v":"<RefSpan>10.000000</RefSpan>"}]
["RefCbar",1,null,{"$f":"\"<\" & A3159 & \">\" & TEXT(B3159,\"0.000000\") & \"</\" & A3159 & \">\"","v":"<RefCbar>1.000000</RefCbar>"}]
["AutoRefAreaFlag",1,null,{"$f":"\"<\" & A3160 & \">\" & TEXT(B3160,0) & \"</\" & A3160 & \">\"","v":"<AutoRefAreaFlag>1</AutoRefAreaFlag>"}]
["AutoRefSpanFlag",1,null,{"$f":"\"<\" & A3161 & \">\" & TEXT(B3161,0) & \"</\" & A3161 & \">\"","v":"<AutoRefSpanFlag>1</AutoRefSpanFlag>"}]
["AutoRefCbarFlag",1,null,{"$f":"\"<\" & A3162 & \">\" & TEXT(B3162,0) & \"</\" & A3162 & \">\"","v":"<AutoRefCbarFlag>1</AutoRefCbarFlag>"}]
["AeroCenter_X",0,null,{"$f":"\"<\" & A3163 & \">\" & TEXT(B3163,\"0.000000\") & \"</\" & A3163 & \">\"","v":"<AeroCenter_X>0.000000</AeroCenter_X>"}]
["AeroCenter_Y",0,null,{"$f":"\"<\" & A3164 & \">\" & TEXT(B3164,\"0.000000\") & \"</\" & A3164 & \">\"","v":"<AeroCenter_Y>0.000000</AeroCenter_Y>"}]
["AeroCenter_Z",0,null,{"$f":"\"<\" & A3165 & \">\" & TEXT(B3165,\"0.000000\") & \"</\" & A3165 & \">\"","v":"<AeroCenter_Z>0.000000</AeroCenter_Z>"}]
["AutoAeroCenterFlag",1,null,{"$f":"\"<\" & A3166 & \">\" & TEXT(B3166,0) & \"</\" & A3166 & \">\"","v":"<AutoAeroCenterFlag>1</AutoAeroCenterFlag>"}]
["WakeActiveFlag",0,null,{"$f":"\"<\" & A3167 & \">\" & TEXT(B3167,0) & \"</\" & A3167 & \">\"","v":"<WakeActiveFlag>0</WakeActiveFlag>"}]
["PosAttachFlag",3,null,{"$f":"\"<\" & A3168 & \">\" & TEXT(B3168,0) & \"</\" & A3168 & \">\"","v":"<PosAttachFlag>3</PosAttachFlag>"}]
["U_Attach",0,null,{"$f":"\"<\" & A3169 & \">\" & TEXT(B3169,\"0.000000\") & \"</\" & A3169 & \">\"","v":"<U_Attach>0.000000</U_Attach>"}]
["V_Attach",0,null,{"$f":"\"<\" & A3170 & \">\" & TEXT(B3170,\"0.000000\") & \"</\" & A3170 & \">\"","v":"<V_Attach>0.000000</V_Attach>"}]
["PtrID",148458299,null,{"$f":"\"<\" & A3171 & \">\" & TEXT(B3171,0) & \"</\" & A3171 & \">\"","v":"<PtrID>148458299</PtrID>"}]
["Parent_PtrID",149518280,null,{"$f":"\"<\" & A3172 & \">\" & TEXT(B3172,0) & \"</\" & A3172 & \">\"","v":"<Parent_PtrID>149518280</Parent_PtrID>"}]
["/General_Parms",null,null,{"$f":"\"<\" & A3173 & \">\"","v":"</General_Parms>"}]
["Mswing_Parms",null,null,{"$f":"\"<\" & A3174 & \">\"","v":"<Mswing_Parms>"}]
["Total_Area",{"$f":"B3235","v":{"$error":"#VALUE!"}},null,{"$f":"\"<\" & A3175 & \">\" & TEXT(B3175,\"0.000000\") & \"</\" & A3175 & \">\"","v":{"$error":"#VALUE!"}}]
["Total_Span",{"$f":"B3236","v":0.9},null,{"$f":"\"<\" & A3176 & \">\" & TEXT(B3176,\"0.000000\") & \"</\" & A3176 & \">\"","v":"<Total_Span>0.900000</Total_Span>"}]
["Total_Proj_Span",{"$f":"B3236*COS(B3243*PI()/180)","v":0.9},null,{"$f":"\"<\" & A3177 & \">\" & TEXT(B3177,\"0.000000\") & \"</\" & A3177 & \">\"","v":"<Total_Proj_Span>0.900000</Total_Proj_Span>"}]
["Avg_Chord",{"$f":"B3175/B3176","v":{"$error":"#VALUE!"}},null,{"$f":"\"<\" & A3178 & \">\" & TEXT(B3178,\"0.000000\") & \"</\" & A3178 & \">\"","v":{"$error":"#VALUE!"}}]
["Sweep_Off",{"$f":"B1580","v":0},null,{"$f":"\"<\" & A3179 & \">\" & TEXT(B3179,\"0.000000\") & \"</\" & A3179 & \">\"","v":"<Sweep_Off>0.000000</Sweep_Off>"}]
["Deg_Per_Seg",9,null,{"$f":"\"<\" & A3180 & \">\" & TEXT(B3180,0) & \"</\" & A3180 & \">\"","v":"<Deg_Per_Seg>9</Deg_Per_Seg>"}]
["Max_Num_Seg",9,null,{"$f":"\"<\" & A3181 & \">\" & TEXT(B3181,0) & \"</\" & A3181 & \">\"","v":"<Max_Num_Seg>9</Max_Num_Seg>"}]
["Rel_Dihedral_Flag",0,null,{"$f":"\"<\" & A3182 & \">\" & TEXT(B3182,0) & \"</\" & A3182 & \">\"","v":"<Rel_Dihedral_Flag>0</Rel_Dihedral_Flag>"}]
["Rel_Twist_Flag",0,null,{"$f":"\"<\" & A3183 & \">\" & TEXT(B3183,0) & \"</\" & A3183 & \">\"","v":"<Rel_Twist_Flag>0</Rel_Twist_Flag>"}]
["Round_End_Cap_Flag",0,null,{"$f":"\"<\" & A3184 & \">\" & TEXT(B3184,0) & \"</\" & A3184 & \">\"","v":"<Round_End_Cap_Flag>0</Round_End_Cap_Flag>"}]
["/Mswing_Parms",null,null,{"$f":"\"<\" & A3185 & \">\"","v":"</Mswing_Parms>"}]
["Airfoil_List",null,null,{"$f":"\"<\" & A3186 & \">\"","v":"<Airfoil_List>"}]
["Airfoil",null,null,{"$f":"\"<\" & A3187 & \">\"","v":"<Airfoil>"}]
["Type",{"$f":"B1589","v":1},null,{"$f":"\"<\" & A3188 & \">\" & TEXT(B3188,0) & \"</\" & A3188 & \">\"","v":"<Type>1</Type>"}]
["Inverted_Flag",0,null,{"$f":"\"<\" & A3189 & \">\" & TEXT(B3189,0) & \"</\" & A3189 & \">\"","v":"<Inverted_Flag>0</Inverted_Flag>"}]
["Camber",0,null,{"$f":"\"<\" & A3190 & \">\" & TEXT(B3190,\"0.000000\") & \"</\" & A3190 & \">\"","v":"<Camber>0.000000</Camber>"}]
["Camber_Loc",0.5,null,"<Camber_Loc>0.500000</Camber_Loc>"]
["Thickness",0.08,null,"<Thickness>0.080000</Thickness>"]
["Thickness_Loc",0.3,null,"<Thickness_Loc>0.300000</Thickness_Loc>"]
["Radius_Le",7.0520000000000001E-3,null,"<Radius_Le>0.007052</Radius_Le>"]
["Radius_Te",0,null,"<Radius_Te>0.000000</Radius_Te>"]
["Six_Series",63,null,{"$f":"\"<\" & A3196 & \">\" & TEXT(B3196,0) & \"</\" & A3196 & \">\"","v":"<Six_Series>63</Six_Series>"}]
["Ideal_Cl",0,null,{"$f":"\"<\" & A3197 & \">\" & TEXT(B3197,\"0.000000\") & \"</\" & A3197 & \">\"","v":"<Ideal_Cl>0.000000</Ideal_Cl>"}]
["A",0,null,{"$f":"\"<\" & A3198 & \">\" & TEXT(B3198,\"0.000000\") & \"</\" & A3198 & \">\"","v":"<A>0.000000</A>"}]
["Slat_Flag",0,null,{"$f":"\"<\" & A3199 & \">\" & TEXT(B3199,0) & \"</\" & A3199 & \">\"","v":"<Slat_Flag>0</Slat_Flag>"}]
["Slat_Shear_Flag",0,null,{"$f":"\"<\" & A3200 & \">\" & TEXT(B3200,0) & \"</\" & A3200 & \">\"","v":"<Slat_Shear_Flag>0</Slat_Shear_Flag>"}]
["Slat_Chord",0.25,null,{"$f":"\"<\" & A3201 & \">\" & TEXT(B3201,\"0.000000\") & \"</\" & A3201 & \">\"","v":"<Slat_Chord>0.250000</Slat_Chord>"}]
["Slat_Angle",10,null,{"$f":"\"<\" & A3202 & \">\" & TEXT(B3202,\"0.000000\") & \"</\" & A3202 & \">\"","v":"<Slat_Angle>10.000000</Slat_Angle>"}]
["Flap_Flag",0,null,{"$f":"\"<\" & A3203 & \">\" & TEXT(B3203,0) & \"</\" & A3203 & \">\"","v":"<Flap_Flag>0</Flap_Flag>"}]
["Flap_Shear_Flag",0,null,{"$f":"\"<\" & A3204 & \">\" & TEXT(B3204,0) & \"</\" & A3204 & \">\"","v":"<Flap_Shear_Flag>0</Flap_Shear_Flag>"}]
["Flap_Chord",0.25,null,{"$f":"\"<\" & A3205 & \">\" & TEXT(B3205,\"0.000000\") & \"</\" & A3205 & \">\"","v":"<Flap_Chord>0.250000</Flap_Chord>"}]
["Flap_Angle",10,null,{"$f":"\"<\" & A3206 & \">\" & TEXT(B3206,\"0.000000\") & \"</\" & A3206 & \">\"","v":"<Flap_Angle>10.000000</Flap_Angle>"}]
["/Airfoil",null,null,{"$f":"\"<\" & A3207 & \">\"","v":"</Airfoil>"}]
["Airfoil",null,null,{"$f":"\"<\" & A3208 & \">\"","v":"<Airfoil>"}]
["Type",{"$f":"B1610","v":1},null,{"$f":"\"<\" & A3209 & \">\" & TEXT(B3209,0) & \"</\" & A3209 & \">\"","v":"<Type>1</Type>"}]
["Inverted_Flag",0,null,{"$f":"\"<\" & A3210 & \">\" & TEXT(B3210,0) & \"</\" & A3210 & \">\"","v":"<Inverted_Flag>0</Inverted_Flag>"}]
["Camber",0,null,{"$f":"\"<\" & A3211 & \">\" & TEXT(B3211,\"0.000000\") & \"</\" & A3211 & \">\"","v":"<Camber>0.000000</Camber>"}]
["Camber_Loc",0.5,null,"<Camber_Loc>0.500000</Camber_Loc>"]
["Thickness",0.08,null,"<Thickness>0.080000</Thickness>"]
["Thickness_Loc",0.3,null,"<Thickness_Loc>0.300000</Thickness_Loc>"]
["Radius_Le",7.0520000000000001E-3,null,"<Radius_Le>0.007052</Radius_Le>"]
["Radius_Te",0,null,"<Radius_Te>0.000000</Radius_Te>"]
["Six_Series",63,null,{"$f":"\"<\" & A3217 & \">\" & TEXT(B3217,0) & \"</\" & A3217 & \">\"","v":"<Six_Series>63</Six_Series>"}]
["Ideal_Cl",0,null,{"$f":"\"<\" & A3218 & \">\" & TEXT(B3218,\"0.000000\") & \"</\" & A3218 & \">\"","v":"<Ideal_Cl>0.000000</Ideal_Cl>"}]
["A",0,null,{"$f":"\"<\" & A3219 & \">\" & TEXT(B3219,\"0.000000\") & \"</\" & A3219 & \">\"","v":"<A>0.000000</A>"}]
["Slat_Flag",0,null,{"$f":"\"<\" & A3220 & \">\" & TEXT(B3220,0) & \"</\" & A3220 & \">\"","v":"<Slat_Flag>0</Slat_Flag>"}]
["Slat_Shear_Flag",0,null,{"$f":"\"<\" & A3221 & \">\" & TEXT(B3221,0) & \"</\" & A3221 & \">\"","v":"<Slat_Shear_Flag>0</Slat_Shear_Flag>"}]
["Slat_Chord",0.25,null,{"$f":"\"<\" & A3222 & \">\" & TEXT(B3222,\"0.000000\") & \"</\" & A3222 & \">\"","v":"<Slat_Chord>0.250000</Slat_Chord>"}]
["Slat_Angle",10,null,{"$f":"\"<\" & A3223 & \">\" & TEXT(B3223,\"0.000000\") & \"</\" & A3223 & \">\"","v":"<Slat_Angle>10.000000</Slat_Angle>"}]
["Flap_Flag",0,null,{"$f":"\"<\" & A3224 & \">\" & TEXT(B3224,0) & \"</\" & A3224 & \">\"","v":"<Flap_Flag>0</Flap_Flag>"}]
["Flap_Shear_Flag",0,null,{"$f":"\"<\" & A3225 & \">\" & TEXT(B3225,0) & \"</\" & A3225 & \">\"","v":"<Flap_Shear_Flag>0</Flap_Shear_Flag>"}]
["Flap_Chord",0.25,null,{"$f":"\"<\" & A3226 & \">\" & TEXT(B3226,\"0.000000\") & \"</\" & A3226 & \">\"","v":"<Flap_Chord>0.250000</Flap_Chord>"}]
["Flap_Angle",10,null,{"$f":"\"<\" & A3227 & \">\" & TEXT(B3227,\"0.000000\") & \"</\" & A3227 & \">\"","v":"<Flap_Angle>10.000000</Flap_Angle>"}]
["/Airfoil",null,null,{"$f":"\"<\" & A3228 & \">\"","v":"</Airfoil>"}]
["/Airfoil_List",null,null,{"$f":"\"<\" & A3229 & \">\"","v":"</Airfoil_List>"}]
["Section_List",null,null,{"$f":"\"<\" & A3230 & \">\"","v":"<Section_List>"}]
["Section",null,null,{"$f":"\"<\" & A3231 & \">\"","v":"<Section>"}]
["Driver",{"$f":"B1633","v":4},null,{"$f":"\"<\" & A3232 & \">\" & TEXT(B3232,0) & \"</\" & A3232 & \">\"","v":"<Driver>4</Driver>"}]
["AR",{"$f":"(B3236^2)/B3235","v":{"$error":"#VALUE!"}},null,{"$f":"\"<\" & A3233 & \">\" & TEXT(B3233,\"0.000000\") & \"</\" & A3233 & \">\"","v":{"$error":"#VALUE!"}}]
["TR",{"$f":"B3237/B3238","v":{"$error":"#VALUE!"}},null,{"$error":"#VALUE!"}]
["Area",{"$f":"0.5*(B3237+B3238)*B3236","v":{"$error":"#VALUE!"}},null,{"$error":"#VALUE!"}]
["Span",{"$f":"B2703","v":0.9},null,"<Span>0.900000</Span>"]
["TC",{"$f":"0.8*IF(-B2827 < b_W.i, c_r.W - B2827*(TAN(phi_100.W.i*PI()/180) - TAN(phi_0.W.i*PI()/180)), c_t.W + ((b_W/2) +B2827)*(TAN(phi_0.W.o*PI()/180) - TAN(phi_100.W.o*PI()/180)))","v":{"$error":"#VALUE!"}},null,{"$error":"#VALUE!"}]
["RC",{"$f":"B3237","v":{"$error":"#VALUE!"}},null,{"$error":"#VALUE!"}]
["Sweep",50,null,"<Sweep>50.000000</Sweep>"]
["SweepLoc",0,null,"<SweepLoc>0.000000</SweepLoc>"]
["Twist",0,null,"<Twist>0.000000</Twist>"]
["TwistLoc",0,null,"<TwistLoc>0.000000</TwistLoc>"]
["Dihedral",0,null,"<Dihedral>0.000000</Dihedral>"]
["Dihed_Crv1",0,null,"<Dihed_Crv1>0.000000</Dihed_Crv1>"]
["Dihed_Crv2",0,null,"<Dihed_Crv2>0.000000</Dihed_Crv2>"]
["Dihed_Crv1_Str",0.75,null,"<Dihed_Crv1_Str>0.750000</Dihed_Crv1_Str>"]
["Dihed_Crv2_Str",0.75,null,"<Dihed_Crv2_Str>0.750000</Dihed_Crv2_Str>"]
["DihedRotFlag",0,null,{"$f":"\"<\" & A3248 & \">\" & TEXT(B3248,0) & \"</\" & A3248 & \">\"","v":"<DihedRotFlag>0</DihedRotFlag>"}]
["SmoothBlendFlag",0,null,{"$f":"\"<\" & A3249 & \">\" & TEXT(B3249,0) & \"</\" & A3249 & \">\"","v":"<SmoothBlendFlag>0</SmoothBlendFlag>"}]
["NumInterpXsecs",1,null,{"$f":"\"<\" & A3250 & \">\" & TEXT(B3250,0) & \"</\" & A3250 & \">\"","v":"<NumInterpXsecs>1</NumInterpXsecs>"}]
["/Section",null,null,{"$f":"\"<\" & A3251 & \">\"","v":"</Section>"}]
["/Section_List",null,null,{"$f":"\"<\" & A3252 & \">\"","v":"</Section_List>"}]
["/Component",null,{"$f":"C3124","v":"Yes"},{"$f":"IF(C3253=\"Yes\",(\"<\"&A3253&\">\"),(\"<\"&A3253&\"-->\"))","v":"</Component>"}]
["Component","FanSect",{"$f":"IF(AND(C2809=\"Yes\",C2956=\"Yes\"),\"No\",\"Yes\")","v":"Yes"},{"$f":"IF(C3254=\"Yes\",(\"<\"&A3254&\">\"),(\"<!--\"&A3254&\">\"))","v":"<Component>"}]
["Type","Engine",null,{"$f":"\"<\" & A3255 & \">\" & TEXT(B3255,\"0.000000\") & \"</\" & A3255 & \">\"","v":"<Type>Engine</Type>"}]
["General_Parms",null,null,{"$f":"\"<\" & A3256 & \">\"","v":"<General_Parms>"}]
["Name",{"$f":"B1658","v":"fan_section"},null,{"$f":"\"<\" & A3257 & \">\" & TEXT(B3257,\"0.000000\") & \"</\" & A3257 & \">\"","v":"<Name>fan_section</Name>"}]
["ColorR",0,null,{"$f":"\"<\" & A3258 & \">\" & TEXT(B3258,\"0.000000\") & \"</\" & A3258 & \">\"","v":"<ColorR>0.000000</ColorR>"}]
["ColorG",0,null,{"$f":"\"<\" & A3259 & \">\" & TEXT(B3259,\"0.000000\") & \"</\" & A3259 & \">\"","v":"<ColorG>0.000000</ColorG>"}]
["ColorB",255,null,{"$f":"\"<\" & A3260 & \">\" & TEXT(B3260,\"0.000000\") & \"</\" & A3260 & \">\"","v":"<ColorB>255.000000</ColorB>"}]
["Symmetry",0,null,{"$f":"\"<\" & A3261 & \">\" & TEXT(B3261,0) & \"</\" & A3261 & \">\"","v":"<Symmetry>0</Symmetry>"}]
["RelXFormFlag",0,null,"<RelXFormFlag>0</RelXFormFlag>"]
["MaterialID",2,null,"<MaterialID>2</MaterialID>"]
["OutputFlag",1,null,"<OutputFlag>1</OutputFlag>"]
["OutputNameID",0,null,"<OutputNameID>0</OutputNameID>"]
["DisplayChildrenFlag",1,null,"<DisplayChildrenFlag>1</DisplayChildrenFlag>"]
["NumPnts",21,null,"<NumPnts>21</NumPnts>"]
["NumXsecs",11,null,"<NumXsecs>11</NumXsecs>"]
["MassPrior",0,null,"<MassPrior>0</MassPrior>"]
["ShellFlag",0,null,"<ShellFlag>0</ShellFlag>"]
["Tran_X",0,null,{"$f":"\"<\" & A3271 & \">\" & TEXT(B3271,\"0.000000\") & \"</\" & A3271 & \">\"","v":"<Tran_X>0.000000</Tran_X>"}]
["Tran_Y",0,null,"<Tran_Y>0.000000</Tran_Y>"]
["Tran_Z",0,null,"<Tran_Z>0.000000</Tran_Z>"]
["TranRel_X",0,null,"<TranRel_X>0.000000</TranRel_X>"]
["TranRel_Y",0,null,"<TranRel_Y>0.000000</TranRel_Y>"]
["TranRel_Z",0,null,"<TranRel_Z>0.000000</TranRel_Z>"]
["Rot_X",0,null,"<Rot_X>0.000000</Rot_X>"]
["Rot_Y",0,null,"<Rot_Y>0.000000</Rot_Y>"]
["Rot_Z",0,null,"<Rot_Z>0.000000</Rot_Z>"]
["RotRel_X",0,null,"<RotRel_X>0.000000</RotRel_X>"]
["RotRel_Y",0,null,"<RotRel_Y>0.000000</RotRel_Y>"]
["RotRel_Z",0,null,"<RotRel_Z>0.000000</RotRel_Z>"]
["Origin",0,null,"<Origin>0.000000</Origin>"]
["Density",1,null,"<Density>1.000000</Density>"]
["ShellMassArea",1,null,"<ShellMassArea>1.000000</ShellMassArea>"]
["RefFlag",0,null,{"$f":"\"<\" & A3286 & \">\" & TEXT(B3286,0) & \"</\" & A3286 & \">\"","v":"<RefFlag>0</RefFlag>"}]
["RefArea",100,null,{"$f":"\"<\" & A3287 & \">\" & TEXT(B3287,\"0.000000\") & \"</\" & A3287 & \">\"","v":"<RefArea>100.000000</RefArea>"}]
["RefSpan",10,null,{"$f":"\"<\" & A3288 & \">\" & TEXT(B3288,\"0.000000\") & \"</\" & A3288 & \">\"","v":"<RefSpan>10.000000</RefSpan>"}]
["RefCbar",1,null,{"$f":"\"<\" & A3289 & \">\" & TEXT(B3289,\"0.000000\") & \"</\" & A3289 & \">\"","v":"<RefCbar>1.000000</RefCbar>"}]
["AutoRefAreaFlag",1,null,{"$f":"\"<\" & A3290 & \">\" & TEXT(B3290,0) & \"</\" & A3290 & \">\"","v":"<AutoRefAreaFlag>1</AutoRefAreaFlag>"}]
["AutoRefSpanFlag",1,null,{"$f":"\"<\" & A3291 & \">\" & TEXT(B3291,0) & \"</\" & A3291 & \">\"","v":"<AutoRefSpanFlag>1</AutoRefSpanFlag>"}]
["AutoRefCbarFlag",1,null,{"$f":"\"<\" & A3292 & \">\" & TEXT(B3292,0) & \"</\" & A3292 & \">\"","v":"<AutoRefCbarFlag>1</AutoRefCbarFlag>"}]
["AeroCenter_X",0,null,{"$f":"\"<\" & A3293 & \">\" & TEXT(B3293,\"0.000000\") & \"</\" & A3293 & \">\"","v":"<AeroCenter_X>0.000000</AeroCenter_X>"}]
["AeroCenter_Y",0,null,{"$f":"\"<\" & A3294 & \">\" & TEXT(B3294,\"0.000000\") & \"</\" & A3294 & \">\"","v":"<AeroCenter_Y>0.000000</AeroCenter_Y>"}]
["AeroCenter_Z",0,null,{"$f":"\"<\" & A3295 & \">\" & TEXT(B3295,\"0.000000\") & \"</\" & A3295 & \">\"","v":"<AeroCenter_Z>0.000000</AeroCenter_Z>"}]
["AutoAeroCenterFlag",1,null,{"$f":"\"<\" & A3296 & \">\" & TEXT(B3296,0) & \"</\" & A3296 & \">\"","v":"<AutoAeroCenterFlag>1</AutoAeroCenterFlag>"}]
["WakeActiveFlag",0,null,{"$f":"\"<\" & A3297 & \">\" & TEXT(B3297,0) & \"</\" & A3297 & \">\"","v":"<WakeActiveFlag>0</WakeActiveFlag>"}]
["PosAttachFlag",3,null,{"$f":"\"<\" & A3298 & \">\" & TEXT(B3298,0) & \"</\" & A3298 & \">\"","v":"<PosAttachFlag>3</PosAttachFlag>"}]
["U_Attach",0,null,{"$f":"\"<\" & A3299 & \">\" & TEXT(B3299,\"0.000000\") & \"</\" & A3299 & \">\"","v":"<U_Attach>0.000000</U_Attach>"}]
["V_Attach",0,null,{"$f":"\"<\" & A3300 & \">\" & TEXT(B3300,\"0.000000\") & \"</\" & A3300 & \">\"","v":"<V_Attach>0.000000</V_Attach>"}]
["PtrID",149750024,null,{"$f":"\"<\" & A3301 & \">\" & TEXT(B3301,0) & \"</\" & A3301 & \">\"","v":"<PtrID>149750024</PtrID>"}]
["Parent_PtrID",149518280,null,{"$f":"\"<\" & A3302 & \">\" & TEXT(B3302,0) & \"</\" & A3302 & \">\"","v":"<Parent_PtrID>149518280</Parent_PtrID>"}]
["/General_Parms",null,null,{"$f":"\"<\" & A3303 & \">\"","v":"</General_Parms>"}]
["Engine_Parms",null,null,{"$f":"\"<\" & A3304 & \">\"","v":"<Engine_Parms>"}]
["Engine_Type",{"$f":"B1706","v":0},null,{"$f":"\"<\" & A3305 & \">\" & TEXT(B3305,0) & \"</\" & A3305 & \">\"","v":"<Engine_Type>0</Engine_Type>"}]
["Radius_Tip",1.69,null,{"$f":"\"<\" & A3306 & \">\" & TEXT(B3306,\"0.000000\") & \"</\" & A3306 & \">\"","v":"<Radius_Tip>1.690000</Radius_Tip>"}]
["Max_Tip",1.1499999999999999,null,{"$f":"\"<\" & A3307 & \">\" & TEXT(B3307,\"0.000000\") & \"</\" & A3307 & \">\"","v":"<Max_Tip>1.150000</Max_Tip>"}]
["Hub_Tip",0.31333299999999997,null,{"$f":"\"<\" & A3308 & \">\" & TEXT(B3308,\"0.000000\") & \"</\" & A3308 & \">\"","v":"<Hub_Tip>0.313333</Hub_Tip>"}]
["Eng_Length",0,null,{"$f":"\"<\" & A3309 & \">\" & TEXT(B3309,\"0.000000\") & \"</\" & A3309 & \">\"","v":"<Eng_Length>0.000000</Eng_Length>"}]
["Inlet_Type",1,null,{"$f":"\"<\" & A3310 & \">\" & TEXT(B3310,0) & \"</\" & A3310 & \">\"","v":"<Inlet_Type>1</Inlet_Type>"}]
["Inl_Noz_Color",0,null,{"$f":"\"<\" & A3311 & \">\" & TEXT(B3311,0) & \"</\" & A3311 & \">\"","v":"<Inl_Noz_Color>0</Inl_Noz_Color>"}]
["Inlet_XY_Sym_Flag",0,null,{"$f":"\"<\" & A3312 & \">\" & TEXT(B3312,0) & \"</\" & A3312 & \">\"","v":"<Inlet_XY_Sym_Flag>0</Inlet_XY_Sym_Flag>"}]
["Inlet_Half_Split_Flag",0,null,{"$f":"\"<\" & A3313 & \">\" & TEXT(B3313,0) & \"</\" & A3313 & \">\"","v":"<Inlet_Half_Split_Flag>0</Inlet_Half_Split_Flag>"}]
["Cowl_Length",1.3726875000000003,null,{"$f":"\"<\" & A3314 & \">\" & TEXT(B3314,\"0.000000\") & \"</\" & A3314 & \">\"","v":"<Cowl_Length>1.372688</Cowl_Length>"}]
["Eng_Thrt_Ratio",1.1499999999999999,null,"<Eng_Thrt_Ratio>1.150000</Eng_Thrt_Ratio>"]
["Hilight_Thrt_Ratio",1.1499999999999999,null,"<Hilight_Thrt_Ratio>1.150000</Hilight_Thrt_Ratio>"]
["Lip_Finess_Ratio",1.026904,null,"<Lip_Finess_Ratio>1.026904</Lip_Finess_Ratio>"]
["Height_Width_Ratio",1,null,"<Height_Width_Ratio>1.000000</Height_Width_Ratio>"]
["Upper_Surf_Shape_Factor",-0.95229299999999995,null,"<Upper_Surf_Shape_Factor>-0.952293</Upper_Surf_Shape_Factor>"]
["Lower_Surf_Shape_Factor",0.66507400000000005,null,"<Lower_Surf_Shape_Factor>0.665074</Lower_Surf_Shape_Factor>"]
["Inlet_X_Axis_Rot",90,null,"<Inlet_X_Axis_Rot>90.000000</Inlet_X_Axis_Rot>"]
["Inlet_Scarf_Angle",2,null,"<Inlet_Scarf_Angle>2.000000</Inlet_Scarf_Angle>"]
["Inlet_Duct_On_Off",0,null,{"$f":"\"<\" & A3323 & \">\" & TEXT(B3323,0) & \"</\" & A3323 & \">\"","v":"<Inlet_Duct_On_Off>0</Inlet_Duct_On_Off>"}]
["Inlet_Duct_X_Offset",3,null,{"$f":"\"<\" & A3324 & \">\" & TEXT(B3324,\"0.000000\") & \"</\" & A3324 & \">\"","v":"<Inlet_Duct_X_Offset>3.000000</Inlet_Duct_X_Offset>"}]
["Inlet_Duct_Y_Offset",1,null,{"$f":"\"<\" & A3325 & \">\" & TEXT(B3325,\"0.000000\") & \"</\" & A3325 & \">\"","v":"<Inlet_Duct_Y_Offset>1.000000</Inlet_Duct_Y_Offset>"}]
["Inlet_Duct_Shape_Factor",0.5,null,{"$f":"\"<\" & A3326 & \">\" & TEXT(B3326,\"0.000000\") & \"</\" & A3326 & \">\"","v":"<Inlet_Duct_Shape_Factor>0.500000</Inlet_Duct_Shape_Factor>"}]
["Divertor_On_Off",0,null,{"$f":"\"<\" & A3327 & \">\" & TEXT(B3327,0) & \"</\" & A3327 & \">\"","v":"<Divertor_On_Off>0</Divertor_On_Off>"}]
["Divertor_Height",0.5,null,{"$f":"\"<\" & A3328 & \">\" & TEXT(B3328,\"0.000000\") & \"</\" & A3328 & \">\"","v":"<Divertor_Height>0.500000</Divertor_Height>"}]
["Divertor_Length",1,null,{"$f":"\"<\" & A3329 & \">\" & TEXT(B3329,\"0.000000\") & \"</\" & A3329 & \">\"","v":"<Divertor_Length>1.000000</Divertor_Length>"}]
["Nozzle_Type",0,null,{"$f":"\"<\" & A3330 & \">\" & TEXT(B3330,0) & \"</\" & A3330 & \">\"","v":"<Nozzle_Type>0</Nozzle_Type>"}]
["Nozzle_Length",1.3726875000000003,null,{"$f":"\"<\" & A3331 & \">\" & TEXT(B3331,\"0.000000\") & \"</\" & A3331 & \">\"","v":"<Nozzle_Length>1.372688</Nozzle_Length>"}]
["Exit_Area_Ratio",1.2,null,{"$f":"\"<\" & A3332 & \">\" & TEXT(B3332,\"0.000000\") & \"</\" & A3332 & \">\"","v":"<Exit_Area_Ratio>1.200000</Exit_Area_Ratio>"}]
["Nozzle_Height_Width_Ratio",1,null,{"$f":"\"<\" & A3333 & \">\" & TEXT(B3333,\"0.000000\") & \"</\" & A3333 & \">\"","v":"<Nozzle_Height_Width_Ratio>1.000000</Nozzle_Height_Width_Ratio>"}]
["Exit_Throat_Ratio",1.5,null,{"$f":"\"<\" & A3334 & \">\" & TEXT(B3334,\"0.000000\") & \"</\" & A3334 & \">\"","v":"<Exit_Throat_Ratio>1.500000</Exit_Throat_Ratio>"}]
["Dive_Flap_Ratio",1,null,{"$f":"\"<\" & A3335 & \">\" & TEXT(B3335,\"0.000000\") & \"</\" & A3335 & \">\"","v":"<Dive_Flap_Ratio>1.000000</Dive_Flap_Ratio>"}]
["Nozzle_Duct_On_Off",0,null,{"$f":"\"<\" & A3336 & \">\" & TEXT(B3336,0) & \"</\" & A3336 & \">\"","v":"<Nozzle_Duct_On_Off>0</Nozzle_Duct_On_Off>"}]
["Nozzle_Duct_X_Offset",1,null,{"$f":"\"<\" & A3337 & \">\" & TEXT(B3337,\"0.000000\") & \"</\" & A3337 & \">\"","v":"<Nozzle_Duct_X_Offset>1.000000</Nozzle_Duct_X_Offset>"}]
["Nozzle_Duct_Y_Offset",0,null,{"$f":"\"<\" & A3338 & \">\" & TEXT(B3338,\"0.000000\") & \"</\" & A3338 & \">\"","v":"<Nozzle_Duct_Y_Offset>0.000000</Nozzle_Duct_Y_Offset>"}]
["Nozzle_Duct_Shape_Factor",0,null,{"$f":"\"<\" & A3339 & \">\" & TEXT(B3339,\"0.000000\") & \"</\" & A3339 & \">\"","v":"<Nozzle_Duct_Shape_Factor>0.000000</Nozzle_Duct_Shape_Factor>"}]
["/Engine_Parms",null,null,{"$f":"\"<\" & A3340 & \">\"","v":"</Engine_Parms>"}]
["/Component",null,{"$f":"IF(OR(C2956=\"Yes\",C2809=\"No\"),\"No\",\"Yes\")","v":"No"},{"$f":"IF(C3341=\"Yes\",(\"<\"&A3341&\">\"),(\"<\"&A3341&\"-->\"))","v":"</Component-->"}]
["Component",{"$f":"B3345 & \" (Model)\"","v":"Gear3 (Model)"},"Yes",{"$f":"IF(C3342=\"Yes\",(\"<\"&A3342&\">\"),(\"<!--\"&A3342&\">\"))","v":"<Component>"}]
["Type","Duct",null,{"$f":"\"<\" & A3343 & \">\" & TEXT(B3343,\"0.000000\") & \"</\" & A3343 & \">\"","v":"<Type>Duct</Type>"}]
["General_Parms",null,null,{"$f":"\"<\" & A3344 & \">\"","v":"<General_Parms>"}]
["Name",{"$f":"\"Gear3\"","v":"Gear3"},null,{"$f":"\"<\" & A3345 & \">\" & TEXT(B3345,\"0.000000\") & \"</\" & A3345 & \">\"","v":"<Name>Gear3</Name>"}]
["ColorR",127,null,{"$f":"\"<\" & A3346 & \">\" & TEXT(B3346,\"0.000000\") & \"</\" & A3346 & \">\"","v":"<ColorR>127.000000</ColorR>"}]
["ColorG",127,null,{"$f":"\"<\" & A3347 & \">\" & TEXT(B3347,\"0.000000\") & \"</\" & A3347 & \">\"","v":"<ColorG>127.000000</ColorG>"}]
["ColorB",127,null,{"$f":"\"<\" & A3348 & \">\" & TEXT(B3348,\"0.000000\") & \"</\" & A3348 & \">\"","v":"<ColorB>127.000000</ColorB>"}]
["Symmetry",0,null,{"$f":"\"<\" & A3349 & \">\" & TEXT(B3349,0) & \"</\" & A3349 & \">\"","v":"<Symmetry>0</Symmetry>"}]
["RelXFormFlag",0,null,"<RelXFormFlag>0</RelXFormFlag>"]
["MaterialID",0,null,"<MaterialID>0</MaterialID>"]
["OutputFlag",1,null,"<OutputFlag>1</OutputFlag>"]
["OutputNameID",0,null,"<OutputNameID>0</OutputNameID>"]
["DisplayChildrenFlag",1,null,"<DisplayChildrenFlag>1</DisplayChildrenFlag>"]
["NumPnts",21,null,"<NumPnts>21</NumPnts>"]
["NumXsecs",41,null,"<NumXsecs>41</NumXsecs>"]
["MassPrior",0,null,"<MassPrior>0</MassPrior>"]
["ShellFlag",0,null,"<ShellFlag>0</ShellFlag>"]
["Tran_X",{"$f":"pos_LG1.x","v":24.365991395960016},null,{"$f":"\"<\" & A3359 & \">\" & TEXT(B3359,\"0.000000\") & \"</\" & A3359 & \">\"","v":"<Tran_X>24.365991</Tran_X>"}]
["Tran_Y",{"$f":"pos_LG1.y","v":6.5414497442631969},null,"<Tran_Y>6.541450</Tran_Y>"]
["Tran_Z",{"$f":"pos_LG1.z","v":-6.0739583333333345},null,"<Tran_Z>-6.073958</Tran_Z>"]
["TranRel_X",0,null,"<TranRel_X>0.000000</TranRel_X>"]
["TranRel_Y",0,null,"<TranRel_Y>0.000000</TranRel_Y>"]
["TranRel_Z",0,null,"<TranRel_Z>0.000000</TranRel_Z>"]
["Rot_X",0,null,"<Rot_X>0.000000</Rot_X>"]
["Rot_Y",0,null,"<Rot_Y>0.000000</Rot_Y>"]
["Rot_Z",90,null,"<Rot_Z>90.000000</Rot_Z>"]
["RotRel_X",0,null,"<RotRel_X>0.000000</RotRel_X>"]
["RotRel_Y",0,null,"<RotRel_Y>0.000000</RotRel_Y>"]
["RotRel_Z",0,null,"<RotRel_Z>0.000000</RotRel_Z>"]
["Origin",0,null,"<Origin>0.000000</Origin>"]
["Density",1,null,"<Density>1.000000</Density>"]
["ShellMassArea",1,null,"<ShellMassArea>1.000000</ShellMassArea>"]
["RefFlag",0,null,{"$f":"\"<\" & A3374 & \">\" & TEXT(B3374,0) & \"</\" & A3374 & \">\"","v":"<RefFlag>0</RefFlag>"}]
["RefArea",100,null,{"$f":"\"<\" & A3375 & \">\" & TEXT(B3375,\"0.000000\") & \"</\" & A3375 & \">\"","v":"<RefArea>100.000000</RefArea>"}]
["RefSpan",10,null,{"$f":"\"<\" & A3376 & \">\" & TEXT(B3376,\"0.000000\") & \"</\" & A3376 & \">\"","v":"<RefSpan>10.000000</RefSpan>"}]
["RefCbar",1,null,{"$f":"\"<\" & A3377 & \">\" & TEXT(B3377,\"0.000000\") & \"</\" & A3377 & \">\"","v":"<RefCbar>1.000000</RefCbar>"}]
["AutoRefAreaFlag",1,null,{"$f":"\"<\" & A3378 & \">\" & TEXT(B3378,0) & \"</\" & A3378 & \">\"","v":"<AutoRefAreaFlag>1</AutoRefAreaFlag>"}]
["AutoRefSpanFlag",1,null,{"$f":"\"<\" & A3379 & \">\" & TEXT(B3379,0) & \"</\" & A3379 & \">\"","v":"<AutoRefSpanFlag>1</AutoRefSpanFlag>"}]
["AutoRefCbarFlag",1,null,{"$f":"\"<\" & A3380 & \">\" & TEXT(B3380,0) & \"</\" & A3380 & \">\"","v":"<AutoRefCbarFlag>1</AutoRefCbarFlag>"}]
["AeroCenter_X",0,null,{"$f":"\"<\" & A3381 & \">\" & TEXT(B3381,\"0.000000\") & \"</\" & A3381 & \">\"","v":"<AeroCenter_X>0.000000</AeroCenter_X>"}]
["AeroCenter_Y",0,null,{"$f":"\"<\" & A3382 & \">\" & TEXT(B3382,\"0.000000\") & \"</\" & A3382 & \">\"","v":"<AeroCenter_Y>0.000000</AeroCenter_Y>"}]
["AeroCenter_Z",0,null,{"$f":"\"<\" & A3383 & \">\" & TEXT(B3383,\"0.000000\") & \"</\" & A3383 & \">\"","v":"<AeroCenter_Z>0.000000</AeroCenter_Z>"}]
["AutoAeroCenterFlag",1,null,{"$f":"\"<\" & A3384 & \">\" & TEXT(B3384,0) & \"</\" & A3384 & \">\"","v":"<AutoAeroCenterFlag>1</AutoAeroCenterFlag>"}]
["WakeActiveFlag",0,null,{"$f":"\"<\" & A3385 & \">\" & TEXT(B3385,0) & \"</\" & A3385 & \">\"","v":"<WakeActiveFlag>0</WakeActiveFlag>"}]
["PosAttachFlag",0,null,{"$f":"\"<\" & A3386 & \">\" & TEXT(B3386,0) & \"</\" & A3386 & \">\"","v":"<PosAttachFlag>0</PosAttachFlag>"}]
["U_Attach",0,null,{"$f":"\"<\" & A3387 & \">\" & TEXT(B3387,\"0.000000\") & \"</\" & A3387 & \">\"","v":"<U_Attach>0.000000</U_Attach>"}]
["V_Attach",0,null,{"$f":"\"<\" & A3388 & \">\" & TEXT(B3388,\"0.000000\") & \"</\" & A3388 & \">\"","v":"<V_Attach>0.000000</V_Attach>"}]
["PtrID",157886,null,{"$f":"\"<\" & A3389 & \">\" & TEXT(B3389,0) & \"</\" & A3389 & \">\"","v":"<PtrID>157886</PtrID>"}]
["Parent_PtrID",0,null,{"$f":"\"<\" & A3390 & \">\" & TEXT(B3390,0) & \"</\" & A3390 & \">\"","v":"<Parent_PtrID>0</Parent_PtrID>"}]
["/General_Parms",null,null,{"$f":"\"<\" & A3391 & \">\"","v":"</General_Parms>"}]
["Duct_Parms",null,null,{"$f":"\"<\" & A3392 & \">\"","v":"<Duct_Parms>"}]
["Length",0.3,null,{"$f":"\"<\" & A3393 & \">\" & TEXT(B3393,\"0.000000\") & \"</\" & A3393 & \">\"","v":"<Length>0.300000</Length>"}]
["Chord",0.3,null,"<Chord>0.300000</Chord>"]
["Inlet_Dia",1,null,"<Inlet_Dia>1.000000</Inlet_Dia>"]
["Inlet_Area",0.78539800000000004,null,"<Inlet_Area>0.785398</Inlet_Area>"]
["Outlet_Dia",{"$f":"B3395","v":1},null,"<Outlet_Dia>1.000000</Outlet_Dia>"]
["Outlet_Area",{"$f":"B3396","v":0.78539800000000004},null,"<Outlet_Area>0.785398</Outlet_Area>"]
["Inlet_Outlet",1,null,"<Inlet_Outlet>1.000000</Inlet_Outlet>"]
["/Duct_Parms",null,null,{"$f":"\"<\" & A3400 & \">\"","v":"</Duct_Parms>"}]
["Airfoil",null,null,{"$f":"\"<\" & A3401 & \">\"","v":"<Airfoil>"}]
["Type",1,null,{"$f":"\"<\" & A3402 & \">\" & TEXT(B3402,0) & \"</\" & A3402 & \">\"","v":"<Type>1</Type>"}]
["Inverted_Flag",0,null,{"$f":"\"<\" & A3403 & \">\" & TEXT(B3403,0) & \"</\" & A3403 & \">\"","v":"<Inverted_Flag>0</Inverted_Flag>"}]
["Camber",0,null,{"$f":"\"<\" & A3404 & \">\" & TEXT(B3404,\"0.000000\") & \"</\" & A3404 & \">\"","v":"<Camber>0.000000</Camber>"}]
["Camber_Loc",0.5,null,"<Camber_Loc>0.500000</Camber_Loc>"]
["Thickness",0.1,null,"<Thickness>0.100000</Thickness>"]
["Thickness_Loc",0.3,null,"<Thickness_Loc>0.300000</Thickness_Loc>"]
["Radius_Le",1.1018999999999999E-2,null,"<Radius_Le>0.011019</Radius_Le>"]
["Radius_Te",0,null,"<Radius_Te>0.000000</Radius_Te>"]
["Six_Series",63,null,{"$f":"\"<\" & A3410 & \">\" & TEXT(B3410,0) & \"</\" & A3410 & \">\"","v":"<Six_Series>63</Six_Series>"}]
["Ideal_Cl",0,null,{"$f":"\"<\" & A3411 & \">\" & TEXT(B3411,\"0.000000\") & \"</\" & A3411 & \">\"","v":"<Ideal_Cl>0.000000</Ideal_Cl>"}]
["A",0,null,{"$f":"\"<\" & A3412 & \">\" & TEXT(B3412,\"0.000000\") & \"</\" & A3412 & \">\"","v":"<A>0.000000</A>"}]
["Slat_Flag",0,null,{"$f":"\"<\" & A3413 & \">\" & TEXT(B3413,0) & \"</\" & A3413 & \">\"","v":"<Slat_Flag>0</Slat_Flag>"}]
["Slat_Shear_Flag",0,null,{"$f":"\"<\" & A3414 & \">\" & TEXT(B3414,0) & \"</\" & A3414 & \">\"","v":"<Slat_Shear_Flag>0</Slat_Shear_Flag>"}]
["Slat_Chord",0.25,null,{"$f":"\"<\" & A3415 & \">\" & TEXT(B3415,\"0.000000\") & \"</\" & A3415 & \">\"","v":"<Slat_Chord>0.250000</Slat_Chord>"}]
["Slat_Angle",10,null,{"$f":"\"<\" & A3416 & \">\" & TEXT(B3416,\"0.000000\") & \"</\" & A3416 & \">\"","v":"<Slat_Angle>10.000000</Slat_Angle>"}]
["Flap_Flag",0,null,{"$f":"\"<\" & A3417 & \">\" & TEXT(B3417,0) & \"</\" & A3417 & \">\"","v":"<Flap_Flag>0</Flap_Flag>"}]
["Flap_Shear_Flag",0,null,{"$f":"\"<\" & A3418 & \">\" & TEXT(B3418,0) & \"</\" & A3418 & \">\"","v":"<Flap_Shear_Flag>0</Flap_Shear_Flag>"}]
["Flap_Chord",0.25,null,{"$f":"\"<\" & A3419 & \">\" & TEXT(B3419,\"0.000000\") & \"</\" & A3419 & \">\"","v":"<Flap_Chord>0.250000</Flap_Chord>"}]
["Flap_Angle",10,null,{"$f":"\"<\" & A3420 & \">\" & TEXT(B3420,\"0.000000\") & \"</\" & A3420 & \">\"","v":"<Flap_Angle>10.000000</Flap_Angle>"}]
["/Airfoil",null,null,{"$f":"\"<\" & A3421 & \">\"","v":"</Airfoil>"}]
["/Component",null,{"$f":"C3342","v":"Yes"},{"$f":"IF(C3422=\"Yes\",(\"<\"&A3422&\">\"),(\"<\"&A3422&\"-->\"))","v":"</Component>"}]
["Component",{"$f":"B3426","v":"Gear1"},"Yes",{"$f":"IF(C3423=\"Yes\",(\"<\"&A3423&\">\"),(\"<!--\"&A3423&\">\"))","v":"<Component>"}]
["Type","Duct",null,{"$f":"\"<\" & A3424 & \">\" & TEXT(B3424,\"0.000000\") & \"</\" & A3424 & \">\"","v":"<Type>Duct</Type>"}]
["General_Parms",null,null,{"$f":"\"<\" & A3425 & \">\"","v":"<General_Parms>"}]
["Name",{"$f":"\"Gear1\"","v":"Gear1"},null,{"$f":"\"<\" & A3426 & \">\" & TEXT(B3426,\"0.000000\") & \"</\" & A3426 & \">\"","v":"<Name>Gear1</Name>"}]
["ColorR",{"$f":"B3346","v":127},null,{"$f":"\"<\" & A3427 & \">\" & TEXT(B3427,\"0.000000\") & \"</\" & A3427 & \">\"","v":"<ColorR>127.000000</ColorR>"}]
["ColorG",{"$f":"B3347","v":127},null,{"$f":"\"<\" & A3428 & \">\" & TEXT(B3428,\"0.000000\") & \"</\" & A3428 & \">\"","v":"<ColorG>127.000000</ColorG>"}]
["ColorB",127,null,{"$f":"\"<\" & A3429 & \">\" & TEXT(B3429,\"0.000000\") & \"</\" & A3429 & \">\"","v":"<ColorB>127.000000</ColorB>"}]
["Symmetry",0,null,{"$f":"\"<\" & A3430 & \">\" & TEXT(B3430,0) & \"</\" & A3430 & \">\"","v":"<Symmetry>0</Symmetry>"}]
["RelXFormFlag",0,null,"<RelXFormFlag>0</RelXFormFlag>"]
["MaterialID",0,null,"<MaterialID>0</MaterialID>"]
["OutputFlag",1,null,"<OutputFlag>1</OutputFlag>"]
["OutputNameID",0,null,"<OutputNameID>0</OutputNameID>"]
["DisplayChildrenFlag",1,null,"<DisplayChildrenFlag>1</DisplayChildrenFlag>"]
["NumPnts",21,null,"<NumPnts>21</NumPnts>"]
["NumXsecs",41,null,"<NumXsecs>41</NumXsecs>"]
["MassPrior",0,null,"<MassPrior>0</MassPrior>"]
["ShellFlag",0,null,"<ShellFlag>0</ShellFlag>"]
["Tran_X",{"$f":"pos_LG2.x","v":24.365991395960016},null,{"$f":"\"<\" & A3440 & \">\" & TEXT(B3440,\"0.000000\") & \"</\" & A3440 & \">\"","v":"<Tran_X>24.365991</Tran_X>"}]
["Tran_Y",{"$f":"pos_LG2.y","v":-6.8414497442631976},null,"<Tran_Y>-6.841450</Tran_Y>"]
["Tran_Z",{"$f":"pos_LG2.z","v":-6.0739583333333345},null,"<Tran_Z>-6.073958</Tran_Z>"]
["TranRel_X",{"$f":"B3362","v":0},null,"<TranRel_X>0.000000</TranRel_X>"]
["TranRel_Y",0,null,"<TranRel_Y>0.000000</TranRel_Y>"]
["TranRel_Z",0,null,"<TranRel_Z>0.000000</TranRel_Z>"]
["Rot_X",0,null,"<Rot_X>0.000000</Rot_X>"]
["Rot_Y",0,null,"<Rot_Y>0.000000</Rot_Y>"]
["Rot_Z",90,null,"<Rot_Z>90.000000</Rot_Z>"]
["RotRel_X",0,null,"<RotRel_X>0.000000</RotRel_X>"]
["RotRel_Y",0,null,"<RotRel_Y>0.000000</RotRel_Y>"]
["RotRel_Z",0,null,"<RotRel_Z>0.000000</RotRel_Z>"]
["Origin",0,null,"<Origin>0.000000</Origin>"]
["Density",1,null,"<Density>1.000000</Density>"]
["ShellMassArea",1,null,"<ShellMassArea>1.000000</ShellMassArea>"]
["RefFlag",0,null,{"$f":"\"<\" & A3455 & \">\" & TEXT(B3455,0) & \"</\" & A3455 & \">\"","v":"<RefFlag>0</RefFlag>"}]
["RefArea",100,null,{"$f":"\"<\" & A3456 & \">\" & TEXT(B3456,\"0.000000\") & \"</\" & A3456 & \">\"","v":"<RefArea>100.000000</RefArea>"}]
["RefSpan",10,null,{"$f":"\"<\" & A3457 & \">\" & TEXT(B3457,\"0.000000\") & \"</\" & A3457 & \">\"","v":"<RefSpan>10.000000</RefSpan>"}]
["RefCbar",1,null,{"$f":"\"<\" & A3458 & \">\" & TEXT(B3458,\"0.000000\") & \"</\" & A3458 & \">\"","v":"<RefCbar>1.000000</RefCbar>"}]
["AutoRefAreaFlag",1,null,{"$f":"\"<\" & A3459 & \">\" & TEXT(B3459,0) & \"</\" & A3459 & \">\"","v":"<AutoRefAreaFlag>1</AutoRefAreaFlag>"}]
["AutoRefSpanFlag",1,null,{"$f":"\"<\" & A3460 & \">\" & TEXT(B3460,0) & \"</\" & A3460 & \">\"","v":"<AutoRefSpanFlag>1</AutoRefSpanFlag>"}]
["AutoRefCbarFlag",1,null,{"$f":"\"<\" & A3461 & \">\" & TEXT(B3461,0) & \"</\" & A3461 & \">\"","v":"<AutoRefCbarFlag>1</AutoRefCbarFlag>"}]
["AeroCenter_X",0,null,{"$f":"\"<\" & A3462 & \">\" & TEXT(B3462,\"0.000000\") & \"</\" & A3462 & \">\"","v":"<AeroCenter_X>0.000000</AeroCenter_X>"}]
["AeroCenter_Y",0,null,{"$f":"\"<\" & A3463 & \">\" & TEXT(B3463,\"0.000000\") & \"</\" & A3463 & \">\"","v":"<AeroCenter_Y>0.000000</AeroCenter_Y>"}]
["AeroCenter_Z",0,null,{"$f":"\"<\" & A3464 & \">\" & TEXT(B3464,\"0.000000\") & \"</\" & A3464 & \">\"","v":"<AeroCenter_Z>0.000000</AeroCenter_Z>"}]
["AutoAeroCenterFlag",1,null,{"$f":"\"<\" & A3465 & \">\" & TEXT(B3465,0) & \"</\" & A3465 & \">\"","v":"<AutoAeroCenterFlag>1</AutoAeroCenterFlag>"}]
["WakeActiveFlag",0,null,{"$f":"\"<\" & A3466 & \">\" & TEXT(B3466,0) & \"</\" & A3466 & \">\"","v":"<WakeActiveFlag>0</WakeActiveFlag>"}]
["PosAttachFlag",0,null,{"$f":"\"<\" & A3467 & \">\" & TEXT(B3467,0) & \"</\" & A3467 & \">\"","v":"<PosAttachFlag>0</PosAttachFlag>"}]
["U_Attach",0,null,{"$f":"\"<\" & A3468 & \">\" & TEXT(B3468,\"0.000000\") & \"</\" & A3468 & \">\"","v":"<U_Attach>0.000000</U_Attach>"}]
["V_Attach",0,null,{"$f":"\"<\" & A3469 & \">\" & TEXT(B3469,\"0.000000\") & \"</\" & A3469 & \">\"","v":"<V_Attach>0.000000</V_Attach>"}]
["PtrID",291434,null,{"$f":"\"<\" & A3470 & \">\" & TEXT(B3470,0) & \"</\" & A3470 & \">\"","v":"<PtrID>291434</PtrID>"}]
["Parent_PtrID",0,null,{"$f":"\"<\" & A3471 & \">\" & TEXT(B3471,0) & \"</\" & A3471 & \">\"","v":"<Parent_PtrID>0</Parent_PtrID>"}]
["/General_Parms",null,null,{"$f":"\"<\" & A3472 & \">\"","v":"</General_Parms>"}]
["Duct_Parms",null,null,{"$f":"\"<\" & A3473 & \">\"","v":"<Duct_Parms>"}]
["Length",{"$f":"B3393","v":0.3},null,{"$f":"\"<\" & A3474 & \">\" & TEXT(B3474,\"0.000000\") & \"</\" & A3474 & \">\"","v":"<Length>0.300000</Length>"}]
["Chord",0.3,null,"<Chord>0.300000</Chord>"]
["Inlet_Dia",1,null,"<Inlet_Dia>1.000000</Inlet_Dia>"]
["Inlet_Area",0.78539800000000004,null,"<Inlet_Area>0.785398</Inlet_Area>"]
["Outlet_Dia",1,null,"<Outlet_Dia>1.000000</Outlet_Dia>"]
["Outlet_Area",0.78539800000000004,null,"<Outlet_Area>0.785398</Outlet_Area>"]
["Inlet_Outlet",1,null,"<Inlet_Outlet>1.000000</Inlet_Outlet>"]
["/Duct_Parms",null,null,{"$f":"\"<\" & A3481 & \">\"","v":"</Duct_Parms>"}]
["Airfoil",null,null,{"$f":"\"<\" & A3482 & \">\"","v":"<Airfoil>"}]
["Type",{"$f":"B3402","v":1},null,{"$f":"\"<\" & A3483 & \">\" & TEXT(B3483,0) & \"</\" & A3483 & \">\"","v":"<Type>1</Type>"}]
["Inverted_Flag",0,null,{"$f":"\"<\" & A3484 & \">\" & TEXT(B3484,0) & \"</\" & A3484 & \">\"","v":"<Inverted_Flag>0</Inverted_Flag>"}]
["Camber",0,null,{"$f":"\"<\" & A3485 & \">\" & TEXT(B3485,\"0.000000\") & \"</\" & A3485 & \">\"","v":"<Camber>0.000000</Camber>"}]
["Camber_Loc",0.5,null,"<Camber_Loc>0.500000</Camber_Loc>"]
["Thickness",0.1,null,"<Thickness>0.100000</Thickness>"]
["Thickness_Loc",0.3,null,"<Thickness_Loc>0.300000</Thickness_Loc>"]
["Radius_Le",1.1018999999999999E-2,null,"<Radius_Le>0.011019</Radius_Le>"]
["Radius_Te",0,null,"<Radius_Te>0.000000</Radius_Te>"]
["Six_Series",63,null,{"$f":"\"<\" & A3491 & \">\" & TEXT(B3491,0) & \"</\" & A3491 & \">\"","v":"<Six_Series>63</Six_Series>"}]
["Ideal_Cl",0,null,{"$f":"\"<\" & A3492 & \">\" & TEXT(B3492,\"0.000000\") & \"</\" & A3492 & \">\"","v":"<Ideal_Cl>0.000000</Ideal_Cl>"}]
["A",0,null,{"$f":"\"<\" & A3493 & \">\" & TEXT(B3493,\"0.000000\") & \"</\" & A3493 & \">\"","v":"<A>0.000000</A>"}]
["Slat_Flag",0,null,{"$f":"\"<\" & A3494 & \">\" & TEXT(B3494,0) & \"</\" & A3494 & \">\"","v":"<Slat_Flag>0</Slat_Flag>"}]
["Slat_Shear_Flag",0,null,{"$f":"\"<\" & A3495 & \">\" & TEXT(B3495,0) & \"</\" & A3495 & \">\"","v":"<Slat_Shear_Flag>0</Slat_Shear_Flag>"}]
["Slat_Chord",0.25,null,{"$f":"\"<\" & A3496 & \">\" & TEXT(B3496,\"0.000000\") & \"</\" & A3496 & \">\"","v":"<Slat_Chord>0.250000</Slat_Chord>"}]
["Slat_Angle",10,null,{"$f":"\"<\" & A3497 & \">\" & TEXT(B3497,\"0.000000\") & \"</\" & A3497 & \">\"","v":"<Slat_Angle>10.000000</Slat_Angle>"}]
["Flap_Flag",0,null,{"$f":"\"<\" & A3498 & \">\" & TEXT(B3498,0) & \"</\" & A3498 & \">\"","v":"<Flap_Flag>0</Flap_Flag>"}]
["Flap_Shear_Flag",0,null,{"$f":"\"<\" & A3499 & \">\" & TEXT(B3499,0) & \"</\" & A3499 & \">\"","v":"<Flap_Shear_Flag>0</Flap_Shear_Flag>"}]
["Flap_Chord",0.25,null,{"$f":"\"<\" & A3500 & \">\" & TEXT(B3500,\"0.000000\") & \"</\" & A3500 & \">\"","v":"<Flap_Chord>0.250000</Flap_Chord>"}]
["Flap_Angle",10,null,{"$f":"\"<\" & A3501 & \">\" & TEXT(B3501,\"0.000000\") & \"</\" & A3501 & \">\"","v":"<Flap_Angle>10.000000</Flap_Angle>"}]
["/Airfoil",null,null,{"$f":"\"<\" & A3502 & \">\"","v":"</Airfoil>"}]
["/Component",null,{"$f":"C3423","v":"Yes"},{"$f":"IF(C3503=\"Yes\",(\"<\"&A3503&\">\"),(\"<\"&A3503&\"-->\"))","v":"</Component>"}]
["Component",{"$f":"B3507","v":"Gear2"},"Yes",{"$f":"IF(C3504=\"Yes\",(\"<\"&A3504&\">\"),(\"<!--\"&A3504&\">\"))","v":"<Component>"}]
["Type","Duct",null,{"$f":"\"<\" & A3505 & \">\" & TEXT(B3505,\"0.000000\") & \"</\" & A3505 & \">\"","v":"<Type>Duct</Type>"}]
["General_Parms",null,null,{"$f":"\"<\" & A3506 & \">\"","v":"<General_Parms>"}]
["Name",{"$f":"\"Gear2\"","v":"Gear2"},null,{"$f":"\"<\" & A3507 & \">\" & TEXT(B3507,\"0.000000\") & \"</\" & A3507 & \">\"","v":"<Name>Gear2</Name>"}]
["ColorR",{"$f":"B3346","v":127},null,{"$f":"\"<\" & A3508 & \">\" & TEXT(B3508,\"0.000000\") & \"</\" & A3508 & \">\"","v":"<ColorR>127.000000</ColorR>"}]
["ColorG",{"$f":"B3347","v":127},null,{"$f":"\"<\" & A3509 & \">\" & TEXT(B3509,\"0.000000\") & \"</\" & A3509 & \">\"","v":"<ColorG>127.000000</ColorG>"}]
["ColorB",127,null,{"$f":"\"<\" & A3510 & \">\" & TEXT(B3510,\"0.000000\") & \"</\" & A3510 & \">\"","v":"<ColorB>127.000000</ColorB>"}]
["Symmetry",0,null,{"$f":"\"<\" & A3511 & \">\" & TEXT(B3511,0) & \"</\" & A3511 & \">\"","v":"<Symmetry>0</Symmetry>"}]
["RelXFormFlag",0,null,"<RelXFormFlag>0</RelXFormFlag>"]
["MaterialID",0,null,"<MaterialID>0</MaterialID>"]
["OutputFlag",1,null,"<OutputFlag>1</OutputFlag>"]
["OutputNameID",0,null,"<OutputNameID>0</OutputNameID>"]
["DisplayChildrenFlag",1,null,"<DisplayChildrenFlag>1</DisplayChildrenFlag>"]
["NumPnts",21,null,"<NumPnts>21</NumPnts>"]
["NumXsecs",41,null,"<NumXsecs>41</NumXsecs>"]
["MassPrior",0,null,"<MassPrior>0</MassPrior>"]
["ShellFlag",0,null,"<ShellFlag>0</ShellFlag>"]
["Tran_X",{"$f":"pos_LG3.x","v":5.8310000000000004},null,{"$f":"\"<\" & A3521 & \">\" & TEXT(B3521,\"0.000000\") & \"</\" & A3521 & \">\"","v":"<Tran_X>5.831000</Tran_X>"}]
["Tran_Y",{"$f":"pos_LG3.y","v":-0.15},null,"<Tran_Y>-0.150000</Tran_Y>"]
["Tran_Z",{"$f":"pos_LG3.z","v":-6.0739583333333345},null,"<Tran_Z>-6.073958</Tran_Z>"]
["TranRel_X",{"$f":"B3362","v":0},null,"<TranRel_X>0.000000</TranRel_X>"]
["TranRel_Y",0,null,"<TranRel_Y>0.000000</TranRel_Y>"]
["TranRel_Z",0,null,"<TranRel_Z>0.000000</TranRel_Z>"]
["Rot_X",0,null,"<Rot_X>0.000000</Rot_X>"]
["Rot_Y",0,null,"<Rot_Y>0.000000</Rot_Y>"]
["Rot_Z",90,null,"<Rot_Z>90.000000</Rot_Z>"]
["RotRel_X",0,null,"<RotRel_X>0.000000</RotRel_X>"]
["RotRel_Y",0,null,"<RotRel_Y>0.000000</RotRel_Y>"]
["RotRel_Z",0,null,"<RotRel_Z>0.000000</RotRel_Z>"]
["Origin",0,null,"<Origin>0.000000</Origin>"]
["Density",1,null,"<Density>1.000000</Density>"]
["ShellMassArea",1,null,"<ShellMassArea>1.000000</ShellMassArea>"]
["RefFlag",0,null,{"$f":"\"<\" & A3536 & \">\" & TEXT(B3536,0) & \"</\" & A3536 & \">\"","v":"<RefFlag>0</RefFlag>"}]
["RefArea",100,null,{"$f":"\"<\" & A3537 & \">\" & TEXT(B3537,\"0.000000\") & \"</\" & A3537 & \">\"","v":"<RefArea>100.000000</RefArea>"}]
["RefSpan",10,null,{"$f":"\"<\" & A3538 & \">\" & TEXT(B3538,\"0.000000\") & \"</\" & A3538 & \">\"","v":"<RefSpan>10.000000</RefSpan>"}]
["RefCbar",1,null,{"$f":"\"<\" & A3539 & \">\" & TEXT(B3539,\"0.000000\") & \"</\" & A3539 & \">\"","v":"<RefCbar>1.000000</RefCbar>"}]
["AutoRefAreaFlag",1,null,{"$f":"\"<\" & A3540 & \">\" & TEXT(B3540,0) & \"</\" & A3540 & \">\"","v":"<AutoRefAreaFlag>1</AutoRefAreaFlag>"}]
["AutoRefSpanFlag",1,null,{"$f":"\"<\" & A3541 & \">\" & TEXT(B3541,0) & \"</\" & A3541 & \">\"","v":"<AutoRefSpanFlag>1</AutoRefSpanFlag>"}]
["AutoRefCbarFlag",1,null,{"$f":"\"<\" & A3542 & \">\" & TEXT(B3542,0) & \"</\" & A3542 & \">\"","v":"<AutoRefCbarFlag>1</AutoRefCbarFlag>"}]
["AeroCenter_X",0,null,{"$f":"\"<\" & A3543 & \">\" & TEXT(B3543,\"0.000000\") & \"</\" & A3543 & \">\"","v":"<AeroCenter_X>0.000000</AeroCenter_X>"}]
["AeroCenter_Y",0,null,{"$f":"\"<\" & A3544 & \">\" & TEXT(B3544,\"0.000000\") & \"</\" & A3544 & \">\"","v":"<AeroCenter_Y>0.000000</AeroCenter_Y>"}]
["AeroCenter_Z",0,null,{"$f":"\"<\" & A3545 & \">\" & TEXT(B3545,\"0.000000\") & \"</\" & A3545 & \">\"","v":"<AeroCenter_Z>0.000000</AeroCenter_Z>"}]
["AutoAeroCenterFlag",1,null,{"$f":"\"<\" & A3546 & \">\" & TEXT(B3546,0) & \"</\" & A3546 & \">\"","v":"<AutoAeroCenterFlag>1</AutoAeroCenterFlag>"}]
["WakeActiveFlag",0,null,{"$f":"\"<\" & A3547 & \">\" & TEXT(B3547,0) & \"</\" & A3547 & \">\"","v":"<WakeActiveFlag>0</WakeActiveFlag>"}]
["PosAttachFlag",0,null,{"$f":"\"<\" & A3548 & \">\" & TEXT(B3548,0) & \"</\" & A3548 & \">\"","v":"<PosAttachFlag>0</PosAttachFlag>"}]
["U_Attach",0,null,{"$f":"\"<\" & A3549 & \">\" & TEXT(B3549,\"0.000000\") & \"</\" & A3549 & \">\"","v":"<U_Attach>0.000000</U_Attach>"}]
["V_Attach",0,null,{"$f":"\"<\" & A3550 & \">\" & TEXT(B3550,\"0.000000\") & \"</\" & A3550 & \">\"","v":"<V_Attach>0.000000</V_Attach>"}]
["PtrID",838,null,{"$f":"\"<\" & A3551 & \">\" & TEXT(B3551,0) & \"</\" & A3551 & \">\"","v":"<PtrID>838</PtrID>"}]
["Parent_PtrID",0,null,{"$f":"\"<\" & A3552 & \">\" & TEXT(B3552,0) & \"</\" & A3552 & \">\"","v":"<Parent_PtrID>0</Parent_PtrID>"}]
["/General_Parms",null,null,{"$f":"\"<\" & A3553 & \">\"","v":"</General_Parms>"}]
["Duct_Parms",null,null,{"$f":"\"<\" & A3554 & \">\"","v":"<Duct_Parms>"}]
["Length",{"$f":"B3393","v":0.3},null,{"$f":"\"<\" & A3555 & \">\" & TEXT(B3555,\"0.000000\") & \"</\" & A3555 & \">\"","v":"<Length>0.300000</Length>"}]
["Chord",0.3,null,"<Chord>0.300000</Chord>"]
["Inlet_Dia",1,null,"<Inlet_Dia>1.000000</Inlet_Dia>"]
["Inlet_Area",0.78539800000000004,null,"<Inlet_Area>0.785398</Inlet_Area>"]
["Outlet_Dia",1,null,"<Outlet_Dia>1.000000</Outlet_Dia>"]
["Outlet_Area",0.78539800000000004,null,"<Outlet_Area>0.785398</Outlet_Area>"]
["Inlet_Outlet",1,null,"<Inlet_Outlet>1.000000</Inlet_Outlet>"]
["/Duct_Parms",null,null,{"$f":"\"<\" & A3562 & \">\"","v":"</Duct_Parms>"}]
["Airfoil",null,null,{"$f":"\"<\" & A3563 & \">\"","v":"<Airfoil>"}]
["Type",{"$f":"B3402","v":1},null,{"$f":"\"<\" & A3564 & \">\" & TEXT(B3564,0) & \"</\" & A3564 & \">\"","v":"<Type>1</Type>"}]
["Inverted_Flag",0,null,{"$f":"\"<\" & A3565 & \">\" & TEXT(B3565,0) & \"</\" & A3565 & \">\"","v":"<Inverted_Flag>0</Inverted_Flag>"}]
["Camber",0,null,{"$f":"\"<\" & A3566 & \">\" & TEXT(B3566,\"0.000000\") & \"</\" & A3566 & \">\"","v":"<Camber>0.000000</Camber>"}]
["Camber_Loc",0.5,null,"<Camber_Loc>0.500000</Camber_Loc>"]
["Thickness",0.1,null,"<Thickness>0.100000</Thickness>"]
["Thickness_Loc",0.3,null,"<Thickness_Loc>0.300000</Thickness_Loc>"]
["Radius_Le",1.1018999999999999E-2,null,"<Radius_Le>0.011019</Radius_Le>"]
["Radius_Te",0,null,"<Radius_Te>0.000000</Radius_Te>"]
["Six_Series",63,null,{"$f":"\"<\" & A3572 & \">\" & TEXT(B3572,0) & \"</\" & A3572 & \">\"","v":"<Six_Series>63</Six_Series>"}]
["Ideal_Cl",0,null,{"$f":"\"<\" & A3573 & \">\" & TEXT(B3573,\"0.000000\") & \"</\" & A3573 & \">\"","v":"<Ideal_Cl>0.000000</Ideal_Cl>"}]
["A",0,null,{"$f":"\"<\" & A3574 & \">\" & TEXT(B3574,\"0.000000\") & \"</\" & A3574 & \">\"","v":"<A>0.000000</A>"}]
["Slat_Flag",0,null,{"$f":"\"<\" & A3575 & \">\" & TEXT(B3575,0) & \"</\" & A3575 & \">\"","v":"<Slat_Flag>0</Slat_Flag>"}]
["Slat_Shear_Flag",0,null,{"$f":"\"<\" & A3576 & \">\" & TEXT(B3576,0) & \"</\" & A3576 & \">\"","v":"<Slat_Shear_Flag>0</Slat_Shear_Flag>"}]
["Slat_Chord",0.25,null,{"$f":"\"<\" & A3577 & \">\" & TEXT(B3577,\"0.000000\") & \"</\" & A3577 & \">\"","v":"<Slat_Chord>0.250000</Slat_Chord>"}]
["Slat_Angle",10,null,{"$f":"\"<\" & A3578 & \">\" & TEXT(B3578,\"0.000000\") & \"</\" & A3578 & \">\"","v":"<Slat_Angle>10.000000</Slat_Angle>"}]
["Flap_Flag",0,null,{"$f":"\"<\" & A3579 & \">\" & TEXT(B3579,0) & \"</\" & A3579 & \">\"","v":"<Flap_Flag>0</Flap_Flag>"}]
["Flap_Shear_Flag",0,null,{"$f":"\"<\" & A3580 & \">\" & TEXT(B3580,0) & \"</\" & A3580 & \">\"","v":"<Flap_Shear_Flag>0</Flap_Shear_Flag>"}]
["Flap_Chord",0.25,null,{"$f":"\"<\" & A3581 & \">\" & TEXT(B3581,\"0.000000\") & \"</\" & A3581 & \">\"","v":"<Flap_Chord>0.250000</Flap_Chord>"}]
["Flap_Angle",10,null,{"$f":"\"<\" & A3582 & \">\" & TEXT(B3582,\"0.000000\") & \"</\" & A3582 & \">\"","v":"<Flap_Angle>10.000000</Flap_Angle>"}]
["/Airfoil",null,null,{"$f":"\"<\" & A3583 & \">\"","v":"</Airfoil>"}]
["/Component",null,{"$f":"C3504","v":"Yes"},{"$f":"IF(C3584=\"Yes\",(\"<\"&A3584&\">\"),(\"<\"&A3584&\"-->\"))","v":"</Component>"}]
["Component","USER PARAMETERS",null,"<Component>"]
["Type","User",null,"<Type>User</Type>"]
["User_Parms",null,null,"<User_Parms>"]
["User1","0.000000",null,"<User1>0.000000</User1>"]
["User2","0.000000",null,"<User2>0.000000</User2>"]
["User3","0.000000",null,"<User3>0.000000</User3>"]
["User4","0.000000",null,"<User4>0.000000</User4>"]
["User5","0.000000",null,"<User5>0.000000</User5>"]
["User6","0.000000",null,"<User6>0.000000</User6>"]
["User7","0.000000",null,"<User7>0.000000</User7>"]
["User8","0.000000",null,"<User8>0.000000</User8>"]
["/User_Parms",null,null,"</User_Parms>"]
["/Component",null,null,"</Component>"]
["/Component_List",null,null,"</Component_List>"]
["Label_List/",null,null,"<Label_List/>"]
["ParmLink_List/",null,null,"<ParmLink_List/>"]
["/Vsp_Geometry",null,null,"</Vsp_Geometry>"]